program: Gaussian 09
title: 000232512
version: EM64L-G09RevD.01
frameworkgroup: C1[X(C12H24O2)]
method: RPBEPBE
basis: SDD
operation: Freq
keyword: #pfreq=noraman
keyword: PBEPBE/SDD
title: #p freq=noraman PBEPBE/SDD
converged: YES YES NO NO
title: Mulliken charges:
elementType: O O C C C C C C C C C C C C H H H H H H H H H H H H H H H H H H H H H H H H
charge: -0.264090 -0.246401 -0.145328 -0.426059 -0.019987 -0.400637 0.206114 -0.725865 -0.717471 -0.704742 -0.307225 -0.347319 -0.348497 -0.687799 0.238381 0.195210 0.213409 0.211868 0.223339 0.204720 0.202396 0.209382 0.237610 0.212819 0.203693 0.217039 0.228834 0.211030 0.215889 0.219010 0.227313 0.222805 0.201534 0.202805 0.192336 0.215011 0.210732 0.218140
chargesum: 0.00000
title: Mulliken charges with hydrogens summed into heavy atoms:
elementType: O O C C C C C C C C C C C C
charge: -0.264090 -0.246401 0.093053 -0.017439 0.191881 0.027422 0.206114 -0.076477 -0.083919 -0.048990 0.139098 0.077020 0.046644 -0.043915
polarizability: 1.54612901e+02 1.96558079e+00 1.37070959e+02 3.20896624e+00 -9.03106247e-01 1.18642663e+02
1716.lowfreq: -13.9418 -3.5718 -0.0007 -0.0005 -0.0004 3.4703 12.5997 29.8036 49.6396
frequency: 10.4740 29.6577 49.4402 56.1574 65.3102 67.6664 95.5466 105.1264 113.1619 159.0454 192.0082 202.6754 208.2459 230.4110 241.8783 249.7831 276.7539 296.0353 303.3172 341.5139 395.8161 408.6086 424.3141 478.5383 517.4026 621.6125 711.7255 742.8554 753.6007 794.7354 810.1323 819.5305 881.4432 894.1831 901.1908 918.5561 935.7800 946.2333 948.2661 960.4364 1026.1643 1032.3621 1048.4788 1074.2309 1080.7037 1097.5249 1102.4875 1117.4576 1134.2850 1155.7836 1164.4056 1180.4830 1223.4612 1226.0716 1250.2799 1268.3628 1269.6739 1288.6404 1289.5964 1301.4874 1328.9564 1330.0769 1339.8237 1344.7255 1356.3276 1372.2753 1378.2716 1391.1071 1392.2312 1394.2576 1450.8723 1452.3654 1463.0727 1469.7955 1470.2251 1471.1512 1476.6676 1477.0601 1478.1592 1480.6365 1482.3309 1488.4678 1493.8316 1633.5870 2955.6691 2964.4676 2965.9816 2968.2072 2970.9848 2975.7777 2976.5199 2982.8096 2988.6113 3013.0580 3019.6111 3020.3381 3030.3289 3047.9462 3048.5338 3057.0653 3063.9478 3069.0648 3073.3783 3074.7795 3075.6331 3075.9148 3077.5706 3099.0123
redmass: 3.3273 3.2596 4.2778 2.4242 2.1269 2.1474 2.9691 2.3452 3.0997 2.1202 1.6880 2.1113 1.3790 1.1307 1.3198 1.4441 2.5305 2.6871 3.4571 3.3925 2.4152 2.6102 2.2760 3.2680 3.6990 2.9497 4.2359 1.1059 1.8256 1.4043 1.8571 1.9252 3.3496 1.5303 1.7723 1.1840 1.4908 1.8546 1.8111 1.5241 2.3483 3.1167 2.0286 2.4079 2.3984 2.4300 2.3344 2.3789 2.0319 2.4709 1.7607 1.7980 1.4325 1.3259 1.2781 1.1928 1.2691 1.1217 1.1054 1.2479 1.4318 1.4461 1.4722 1.4191 1.4305 1.4277 1.2288 1.2158 1.2123 1.2142 1.0882 1.0934 1.0749 1.0608 1.0675 1.0478 1.0576 1.0478 1.0485 1.0552 1.0514 1.0849 1.0481 8.4216 1.0761 1.0570 1.0405 1.0588 1.0403 1.0364 1.0356 1.0604 1.0594 1.0998 1.0673 1.0833 1.0987 1.0952 1.1028 1.0991 1.0987 1.0994 1.1011 1.1000 1.1000 1.0994 1.0987 1.1084
irintensity: 0.5596 0.2534 0.8053 0.0304 0.1038 0.0945 1.1845 0.2231 0.2478 0.2800 1.1768 1.3297 0.8721 0.5084 0.9142 0.9781 0.8751 0.4412 9.2699 6.2906 0.8517 2.5941 1.4064 7.7254 0.2843 1.1735 3.1624 14.7695 5.7522 3.9923 4.0702 2.7294 10.0727 7.0406 4.6054 3.6067 16.0897 1.0500 22.6875 0.5651 4.6620 20.9326 1.9366 3.0856 41.6047 201.9162 18.2679 5.1152 67.9563 11.1762 10.5533 8.1560 4.9836 2.7944 7.6074 3.7776 4.7453 1.0905 0.8236 0.9059 1.8692 10.6283 6.4753 1.1046 22.4424 7.2984 17.9108 10.8310 16.9371 15.4892 2.2457 7.2386 6.7693 10.2425 0.4860 7.7490 7.1289 11.6297 9.4485 4.8840 13.1837 18.9816 21.4387 115.6399 6.8345 19.0445 49.9634 30.0251 41.4423 30.2192 33.1261 41.3798 27.7976 6.8341 48.0099 8.2147 2.9860 9.5538 13.7383 6.0600 77.7542 47.8784 61.2398 66.5963 70.2374 49.0378 31.5394 34.5858
temp: 298.150 k
press: 1.00000 atm
elementType: 8 8 6 6 6 6 6 6 6 6 6 6 6 6 1 1 1 1 1 1 1 1 1 1 1 1 1 1 1 1 1 1 1 1 1 1 1 1
symmnumber: 1
zpe: 888242.8 jmol-1
zpe.correction: 0.338314 hartree
zpe.thermalcorrener: 0.356843 hartree
zpe.thermalcorrenthalpy: 0.357787 hartree
zpe.thermalcorrgfe: 0.289070 hartree
zpe.sumelectzpe: -620.969864 hartree
zpe.sumelectthermal: -620.951335 hartree
zpe.sumelectthermalent: -620.950390 hartree
zpe.sumelectthermalfe: -621.019108 hartree
dipole: 0.5104 0.4204 1.4207
dipole: 1.5670
quadrupole: -79.9093 -88.6258 -94.2629
quadrupole: -1.2536 0.3538 -2.1991
quadrupole: 7.6900 -1.0265 -6.6636 -1.2536 0.3538 -2.1991
hfenergy: -621.3081775 hartree
pointgroup: C01 [X(C12H24O2)]
dipole: 0.2039566 -0.1516409 -0.5616923 debye
polarizability: 152.8408606|-5.9418971|139.0608853|-0.7530604|1.6122609|118.4247769 unknown
InChI: InChI=1S/C12H24O2/c1-5-7-8-14-12(13)11(6-2)9-10(3)4/h10-11H,5-9H2,1-4H3
charge 0 multiplicity 1
38 atoms
O  0.777117 0.998077 -0.724013
O  0.076601 0.996933 1.503107
C  -1.604879 0.989601 -0.312276
C  -2.321737 -0.342976 0.055737
C  -1.621202 -1.646432 -0.412899
C  -2.405436 2.209615 0.224202
C  -0.200312 0.995573 0.27982
C  -1.440336 -1.701596 -1.948824
C  -2.416204 -2.875152 0.089647
C  -1.829424 3.572399 -0.214262
C  2.202079 0.955102 -0.271717
C  2.675154 -0.492968 -0.086091
C  4.176137 -0.561088 0.28327
C  4.673525 -2.013141 0.450717
H  -1.509437 1.07375 -1.409677
H  -3.341587 -0.307557 -0.380969
H  -2.441695 -0.374396 1.157317
H  -0.613284 -1.681927 0.053195
H  -2.435126 2.151242 1.329426
H  -3.449564 2.113576 -0.133834
H  -2.418398 -1.614943 -2.46177
H  -0.986094 -2.663013 -2.253419
H  -0.784264 -0.891557 -2.313699
H  -1.912944 -3.818608 -0.192578
H  -3.432439 -2.890883 -0.350691
H  -2.524092 -2.862027 1.190399
H  -0.806104 3.72108 0.177117
H  -1.784656 3.653211 -1.316516
H  -2.453699 4.403066 0.16224
H  2.751663 1.463083 -1.081832
H  2.293124 1.525541 0.670525
H  2.074863 -0.971546 0.711099
H  2.494804 -1.057917 -1.021619
H  4.350303 -0.000204 1.223643
H  4.773809 -0.053703 -0.501493
H  4.113888 -2.53305 1.250501
H  4.537082 -2.588714 -0.484053
H  5.746566 -2.043252 0.713773
