program: Gaussian 09
title: 000232497
version: EM64L-G09RevD.01
frameworkgroup: C1[X(C9H9BrO3)]
method: RPBEPBE
basis: SDD
operation: Freq
keyword: #p
keyword: freq=noraman
keyword: PBEPBE/SDD
title: #p freq=noraman PBEPBE/SDD
converged: YES YES NO NO
title: Mulliken charges:
elementType: Br O O O C C C C C C C C C H H H H H H H H H
charge: -0.004428 -0.262808 -0.261109 -0.267461 0.538424 0.198119 0.183627 -0.450536 -0.434331 -0.293755 -0.420177 -0.200775 -0.509972 0.297444 0.275071 0.254683 0.211215 0.241688 0.239520 0.207739 0.236023 0.221800
chargesum: 0.00000
title: Mulliken charges with hydrogens summed into heavy atoms:
elementType: Br O O O C C C C C C C C C
charge: -0.004428 -0.262808 -0.261109 -0.267461 0.538424 0.198119 0.183627 -0.153092 -0.434331 -0.018684 0.045720 0.280433 0.155590
polarizability: 1.74021647e+02 4.56806592e+00 1.25083307e+02 2.57532355e+00 -5.95906456e+00 6.54897191e+01
1716.lowfreq: -57.7562 -7.0878 -1.1067 -0.0008 -0.0007 -0.0005 6.0966 39.1991 75.3228
frequency: -57.6867 39.1881 75.3141 101.9002 143.6805 160.5982 165.7525 205.6839 257.0241 268.9305 323.0819 333.5038 397.4297 427.8620 492.6619 534.5271 611.0307 644.5958 680.2466 708.4207 743.6039 791.7417 838.9298 852.4829 861.2403 901.5111 931.2254 976.1842 995.7320 1053.3935 1062.7940 1064.8325 1114.2355 1119.6321 1139.4829 1152.9102 1207.4848 1246.6655 1253.1189 1324.4366 1361.8350 1380.5685 1405.5937 1432.5776 1450.6406 1457.6442 1461.3652 1475.4898 1484.9413 1603.1652 1622.4757 2941.3947 2967.2319 3015.7032 3021.8637 3043.9313 3095.5219 3109.5694 3174.7034 3193.4853
redmass: 2.3046 3.3044 3.7503 7.1117 2.2268 4.6412 2.8670 2.5133 5.7515 9.1878 4.0125 8.3529 2.7188 3.1054 5.2245 5.7931 6.8014 8.2892 9.9135 4.5224 6.3039 5.8666 9.9818 1.4167 4.6260 1.3546 5.1334 5.3018 1.9002 4.9055 1.4781 3.6259 1.2619 1.0369 1.9587 1.5283 1.3194 2.5766 1.6720 1.5371 1.3615 2.4187 5.4132 1.1491 1.3210 1.1253 1.9830 1.0532 1.1918 8.8144 9.3253 1.0335 1.0620 1.0537 1.1025 1.0997 1.1188 1.0987 1.0925 1.0937
irintensity: 14.8067 2.1533 1.1172 0.7050 3.2703 1.3036 0.0579 4.6317 1.3042 6.1849 6.3442 1.1655 1.0864 14.8594 11.4650 16.1622 1.3201 16.7440 1.5844 0.5993 0.3482 23.1769 24.4209 20.9678 16.4433 34.7095 39.0062 132.3009 24.1337 89.8892 5.4379 60.9687 0.0988 0.0306 7.4736 11.0230 0.3205 126.6691 66.9178 28.0320 1.9231 45.4584 1.9738 8.0735 77.9355 67.0136 118.1015 8.3588 13.1881 3.9837 3.1265 60.1535 31.4313 122.6142 54.6041 13.5423 30.5555 30.0552 3.6311 1.0125
temp: 298.150 k
press: 1.00000 atm
elementType: 35 8 8 8 6 6 6 6 6 6 6 6 6 1 1 1 1 1 1 1 1 1
symmnumber: 1
zpe: 424092.8 jmol-1
zpe.correction: 0.161528 hartree
zpe.thermalcorrener: 0.173281 hartree
zpe.thermalcorrenthalpy: 0.174225 hartree
zpe.thermalcorrgfe: 0.121882 hartree
zpe.sumelectzpe: -586.470908 hartree
zpe.sumelectthermal: -586.459156 hartree
zpe.sumelectthermalent: -586.458211 hartree
zpe.sumelectthermalfe: -586.510555 hartree
dipole: 1.6452 0.1263 1.2647
dipole: 2.0789
quadrupole: -74.2357 -89.0656 -84.8855
quadrupole: -2.2272 -0.6426 5.1990
quadrupole: 8.4932 -6.3367 -2.1566 -2.2272 -0.6426 5.1990
hfenergy: -586.6324367 hartree
pointgroup: C01 [X(C9H9Br1O3)]
dipole: 0.4677914 -0.1148306 -0.6610408 debye
dipolederiv: -0.2654112 0.255757 0.1243473 0.2556371 -0.421604 -0.1597872 0.1116737 -0.1460488 -0.1074661 -1.226615 0.3141347 0.3438766 0.3913326 -0.567624 -0.1651048 0.3676288 -0.1508666 -0.3852706 -1.3409014 0.2017891 0.3602237 0.1300624 -0.4587669 -0.0798884 0.3703456 -0.0993729 -0.3755821 -0.6823531 -0.164922 -0.1173712 -0.2073013 -0.4950334 -0.1500863 -0.287099 -0.1887072 -0.695824 -0.1938414 0.0936811 0.0342962 0.1531867 -0.2829008 -0.158696 -0.0018117 -0.1058843 -0.0783218 0.6222497 -0.352679 -0.2198378 -0.8902052 0.3889163 0.3202907 -0.315586 0.1720107 0.1625533 1.0967598 -0.1202635 -0.3380942 0.3401 -0.071838 -0.1227177 -0.2812821 0.0159329 0.1250503 -0.1078029 0.0329187 -0.0197675 -0.0056384 -0.0208542 0.008852 0.0089062 0.0144409 -0.1412735 0.2795673 -0.4182556 -0.254024 -0.4943179 0.723529 0.3510973 -0.2606718 0.2818016 -0.0112497 -0.2170643 0.0423178 0.039452 0.2251423 -0.1338609 -0.0938733 0.0859264 -0.0210589 -0.1299395 0.584805 0.2188483 0.0964151 0.2587831 0.5005728 0.2036715 0.1538903 0.1154059 0.340547 1.1214329 -0.1818958 -0.2080081 -0.1767906 0.5804412 0.0590246 -0.2273477 0.0654034 0.6530033 0.4143169 0.0353761 0.0849377 -0.0818434 0.193717 -0.0369645 0.2341235 0.1047081 0.5371311 0.1640905 0.0037618 0.0297299 0.0020713 0.0176815 -0.029485 0.0205148 -0.0295943 0.1528727 0.0966975 -0.040791 0.01607 -0.0442505 0.0164661 -0.014653 0.0220471 -0.0145545 0.1717518 -0.001467 -0.0554069 -0.0028859 -0.0964689 0.0433959 0.0332978 0.0065889 0.0007899 -0.1097412 -0.067086 0.0571465 -0.0176492 0.0741958 -0.0575285 -0.0282461 -0.0369104 0.0378601 0.071613 -0.1505591 0.0719803 -0.0229366 0.0773158 0.0416296 0.0104144 -0.1131622 0.0398394 0.0064362 -0.0207423 0.025739 0.0461414 0.0187079 0.0580947 -0.002713 0.1541047 -0.0374371 -0.1527926 -0.0952238 0.094532 -0.0608925 0.198787 -0.0218276 0.0630002 -0.025969 -0.0288276 0.0011186 0.0649126 -0.0676219 -0.0481426 -0.1026379 -0.0901379 -0.0924662 -0.0594567 -0.0686446 0.0391237 -0.0757646 -0.0461467 0.1341199 -0.0258679 0.0575319 0.085033 0.0735465 0.0428038 -0.07374 unknown
polarizability: 156.5335646|-14.419029|130.7846064|-26.7389459|21.4418216|77.2765019 unknown
InChI: InChI=1S/C9H9BrO3/c1-11-4-6-2-8-9(3-7(6)10)13-5-12-8/h2-3H,4-5H2,1H3
charge 0 multiplicity 1
22 atoms
Br -1.869392 2.738243 1.440677
O  2.07676 -1.530201 -0.518733
O  2.8231 0.753503 -0.390289
O  -3.020367 -1.688846 0.504728
C  -1.160869 -0.041624 0.738396
C  1.032297 -0.691674 -0.057508
C  1.473813 0.646409 0.017971
C  -0.262289 -1.061122 0.296584
C  -0.688108 1.290018 0.806492
C  0.6344 1.67214 0.452177
C  -2.572897 -0.456684 1.155307
C  3.233767 -0.6292 -0.767937
C  -3.400833 -1.482772 -0.897782
H  -0.618317 -2.09338 0.244855
H  0.973837 2.707421 0.515668
H  -2.600516 -0.688422 2.235918
H  -3.28953 0.368727 0.964895
H  4.076288 -0.939053 -0.12709
H  3.479974 -0.647037 -1.843808
H  -4.222056 -0.740629 -0.981255
H  -3.748756 -2.461351 -1.263225
H  -2.542504 -1.141364 -1.511239
