program: Gaussian 09
title: 000232499
version: EM64L-G09RevD.01
frameworkgroup: C1[X(C12H15BrO4)]
method: RPBEPBE
basis: SDD
operation: Freq
keyword: #p
keyword: freq=noraman
keyword: PBEPBE/SDD
title: #p freq=noraman PBEPBE/SDD
converged: YES YES NO NO
title: Mulliken charges:
elementType: Br O O O O C C C C C C C C C C C C H H H H H H H H H H H H H H H
charge: -0.007605 -0.278966 -0.262788 -0.258785 -0.287634 0.031856 0.661907 -0.437728 -0.310420 0.194128 -0.523886 0.186940 -0.703014 -0.397712 -0.294598 -0.202817 -0.490609 0.206580 0.205452 0.210177 0.222056 0.196262 0.265750 0.215227 0.252203 0.215045 0.274077 0.244272 0.237001 0.231480 0.201832 0.204317
chargesum: 0.00000
title: Mulliken charges with hydrogens summed into heavy atoms:
elementType: Br O O O O C C C C C C C C C C C C
charge: -0.007605 -0.278966 -0.262788 -0.258785 -0.287634 0.238435 0.661907 -0.022098 0.107899 0.194128 -0.258136 0.186940 -0.020539 -0.397712 -0.020522 0.278456 0.147020
polarizability: 2.27754480e+02 2.18407605e+01 1.54754528e+02 -1.92879425e+01 7.45852607e+00 1.06852983e+02
1716.lowfreq: -4.0892 0.0002 0.0005 0.0009 4.3182 7.9956 15.7783 25.5275 37.1224
frequency: 15.5642 25.3668 37.1030 69.4107 81.8139 87.7514 96.2647 116.9904 136.8361 171.5572 201.8070 202.8152 216.6472 232.6662 262.3628 271.9368 303.1584 321.9603 339.2837 390.1596 429.5575 438.8615 476.6269 493.8855 558.3095 636.0731 663.3714 678.6064 707.2779 752.8784 792.2483 824.0392 838.3777 857.3308 875.5272 886.6857 914.0222 926.2037 936.5687 970.4445 982.1454 995.1717 1060.6746 1069.0976 1071.9310 1082.9416 1106.3069 1126.9451 1130.4780 1146.3158 1164.6437 1172.6903 1198.2498 1221.2636 1235.5512 1258.7949 1291.0380 1338.0149 1355.5340 1363.0159 1375.9808 1381.9730 1390.5991 1413.0964 1438.3138 1456.8729 1464.0727 1465.4542 1469.0880 1471.7413 1479.7907 1486.3107 1487.6103 1604.1341 1621.0342 2924.0374 2937.2576 2948.9622 2951.9204 2983.1240 2997.8097 3001.3108 3003.0484 3005.7500 3079.9618 3093.4638 3101.3275 3112.6264 3171.3997 3193.2462
redmass: 7.2535 3.5299 4.0103 3.1749 2.4516 3.0362 4.0829 4.7148 3.9128 6.9124 1.5064 4.6950 1.5999 1.8082 6.6982 4.2825 3.5769 3.2854 5.3944 3.5942 2.9583 4.4055 3.9556 2.6915 4.9373 8.1550 8.1379 9.4621 4.4672 5.3193 5.7382 3.2822 7.2596 1.4487 1.7968 2.8099 2.9989 1.2655 4.1012 4.1285 3.0099 2.2193 3.5912 3.1361 1.6495 3.5609 1.3295 1.0595 1.6195 1.5876 1.8546 1.5711 1.2297 1.3753 1.2893 5.5707 1.1704 1.3363 1.5646 1.2988 1.4405 1.5903 1.9558 6.8931 1.1509 1.0517 2.2310 1.1690 1.0536 1.0728 1.0895 1.2525 1.0719 8.4878 9.2923 1.0362 1.0560 1.0572 1.0799 1.0359 1.1024 1.1065 1.1053 1.0601 1.1003 1.0990 1.0974 1.1115 1.0930 1.0937
irintensity: 0.3099 0.1078 0.5348 0.6597 9.4640 9.0632 5.0310 2.4671 3.3106 0.6901 2.3009 1.2585 3.5975 1.4282 1.1202 5.1990 3.3662 2.7614 0.9299 2.5345 9.1747 3.5682 5.8425 1.6396 15.5556 12.3762 4.4036 1.1983 1.2842 0.4048 20.6993 14.0938 38.6230 8.6773 60.6490 9.0784 1.4840 1.2046 28.1267 110.9928 128.5559 12.6942 15.4664 34.5897 19.4462 293.3647 0.1425 1.0582 2.2653 2.1446 24.8150 12.6848 6.8772 14.6489 28.6076 161.8633 18.7444 6.6974 3.2728 0.9554 38.5029 11.8125 43.4387 27.5011 1.0987 11.8524 210.2621 3.1619 19.6938 1.9082 2.0765 25.0843 5.7304 2.5837 9.3822 78.1655 46.7073 36.9870 51.2976 17.0229 116.6318 9.3968 39.2195 124.3742 40.9935 18.8651 33.7959 28.5859 1.7882 0.8385
temp: 298.150 k
press: 1.00000 atm
elementType: 35 8 8 8 8 6 6 6 6 6 6 6 6 6 6 6 6 1 1 1 1 1 1 1 1 1 1 1 1 1 1 1
symmnumber: 1
zpe: 652685.4 jmol-1
zpe.correction: 0.248595 hartree
zpe.thermalcorrener: 0.266611 hartree
zpe.thermalcorrenthalpy: 0.267555 hartree
zpe.thermalcorrgfe: 0.199148 hartree
zpe.sumelectzpe: -779.264780 hartree
zpe.sumelectthermal: -779.246764 hartree
zpe.sumelectthermalent: -779.245820 hartree
zpe.sumelectthermalfe: -779.314227 hartree
dipole: -1.0609 -1.2862 0.8023
dipole: 1.8503
quadrupole: -93.9878 -110.6104 -104.7187
quadrupole: 3.2009 1.6069 0.9262
quadrupole: 9.1179 -7.5048 -1.6131 3.2009 1.6069 0.9262
hfenergy: -779.5133747 hartree
pointgroup: C01 [X(C12H15Br1O4)]
dipole: -0.3922234 0.5027312 -0.3511945 debye
polarizability: 225.4841576|-23.9693513|157.8393614|20.9967212|2.8863718|106.0384721 unknown
InChI: InChI=1S/C12H15BrO4/c1-8(5-14-2)15-6-9-3-11-12(4-10(9)13)17-7-16-11/h3-4,8H,5-7H2,1-2H3
charge 0 multiplicity 1
32 atoms
Br 0.24723 -2.529513 0.633268
O  1.658632 0.63389 0.101205
O  -3.975474 1.829149 -0.246718
O  -4.543847 -0.443376 -0.77265
O  5.153197 -0.287703 -0.496882
C  3.058729 0.37312 0.504632
C  -0.660171 0.27488 0.703244
C  0.710348 0.636842 1.231346
C  3.7772 0.09972 -0.822928
C  -2.871726 0.973337 -0.003553
C  -1.619668 1.313779 0.504699
C  -3.20844 -0.360743 -0.312656
C  3.678502 1.542084 1.285958
C  -1.030597 -1.056304 0.383131
C  -2.306434 -1.410064 -0.127834
C  -4.986665 0.971902 -0.920788
C  5.932997 -0.598721 -1.691202
H  3.089213 -0.554505 1.117838
H  0.682475 1.641522 1.699765
H  1.042281 -0.098306 1.994753
H  3.253673 -0.717686 -1.362381
H  3.766247 1.012137 -1.459367
H  -1.363474 2.350622 0.738337
H  3.195753 1.678603 2.270493
H  4.751679 1.340432 1.449109
H  3.579293 2.481328 0.711596
H  -2.569722 -2.443003 -0.361971
H  -5.95703 1.096603 -0.416821
H  -5.017647 1.22648 -1.996636
H  6.940321 -0.875117 -1.341635
H  6.005553 0.278272 -2.369952
H  5.492372 -1.448761 -2.254996
