program: Gaussian 09
title: 000232486
version: EM64L-G09RevD.01
frameworkgroup: C1[X(C7H8N2O)]
method: RPBEPBE
basis: SDD
operation: Freq
keyword: #pfreq=noraman
keyword: PBEPBE/SDD
title: #p freq=noraman PBEPBE/SDD
converged: NO NO NO NO
title: Mulliken charges:
elementType: O N N C C C C C C C H H H H H H H H
charge: -0.414196 -0.002634 -0.064078 0.358775 0.264569 -0.333620 -0.811294 -0.431398 -0.329013 -0.323167 0.232905 0.239683 0.233074 0.239707 0.275271 0.241654 0.250075 0.373687
chargesum: 0.00000
title: Mulliken charges with hydrogens summed into heavy atoms:
elementType: O N N C C C C C C C
charge: -0.040510 -0.002634 -0.064078 0.358775 0.264569 -0.100715 -0.098830 -0.156127 -0.087359 -0.073092
polarizability: 1.54385234e+02 3.14782303e+00 9.76882719e+01 -5.02166673e-03 5.90094842e-03 4.18301721e+01
1716.lowfreq: -0.0014 -0.0007 -0.0006 5.2428 6.0194 7.3971 51.0813 116.8809 137.6694
frequency: 50.2238 116.8389 137.6617 161.8974 194.7624 296.1505 300.9492 371.1639 423.9358 449.5849 466.1217 524.2284 549.0506 655.3716 744.2020 786.3951 838.7228 847.1053 917.4883 937.5632 949.0016 966.0099 982.1656 1042.7574 1057.7208 1148.0771 1202.4039 1218.4766 1250.9570 1300.2137 1309.7987 1383.1765 1398.5353 1404.7981 1468.0251 1472.6851 1472.7080 1536.9304 1565.5908 1590.1163 2977.7922 3056.0067 3079.6884 3091.6292 3128.6567 3148.3096 3154.2064 3586.5049
redmass: 2.8410 5.0386 4.9263 1.0566 4.2369 3.2590 3.9027 5.8178 1.1286 2.9244 3.9045 6.0865 4.4533 6.5209 2.7165 4.8643 1.3141 4.8365 9.0208 1.3712 1.5137 1.4666 1.7086 1.5797 1.9178 3.7533 1.5948 1.3494 1.8951 2.3802 2.4924 1.4956 1.2307 2.3975 2.3509 1.0928 1.0771 5.3860 5.8184 6.1388 1.0378 1.0975 1.0893 1.0980 1.0875 1.0921 1.0979 1.0675
irintensity: 0.6963 0.1346 0.1295 1.3393 0.0128 0.0153 2.8893 2.2897 176.4940 6.8724 4.1186 5.0438 8.6827 20.9984 6.8198 25.9809 28.6751 36.0466 155.8565 0.9429 25.4713 0.8879 0.9653 7.7939 2.6301 10.5588 22.0357 63.5325 0.7893 3.8055 0.7513 12.1976 21.4039 21.7595 19.1903 17.4996 16.6151 12.1061 2.3496 26.0628 16.1423 14.8364 12.9273 20.0498 4.8912 24.0532 15.6520 90.5062
temp: 298.150 k
press: 1.00000 atm
elementType: 8 7 7 6 6 6 6 6 6 6 1 1 1 1 1 1 1 1
symmnumber: 1
zpe: 363140.6 jmol-1
zpe.correction: 0.138313 hartree
zpe.thermalcorrener: 0.147788 hartree
zpe.thermalcorrenthalpy: 0.148732 hartree
zpe.thermalcorrgfe: 0.103241 hartree
zpe.sumelectzpe: -455.481279 hartree
zpe.sumelectthermal: -455.471804 hartree
zpe.sumelectthermalent: -455.470860 hartree
zpe.sumelectthermalfe: -455.516351 hartree
dipole: -0.4613 3.0033 0.0000
dipole: 3.0386
quadrupole: -49.3208 -59.5317 -61.0956
quadrupole: 9.4761 0.0017 0.0000
quadrupole: 7.3285 -2.8823 -4.4462 9.4761 0.0017 0.0000
hfenergy: -455.619592 hartree
pointgroup: C01 [X(C7H8N2O1)]
dipole: 0.21894 -1.1752398 -0.0000175 debye
dipolederiv: -1.6019251 -0.0842953 -0.0000303 0.6049982 -0.0108988 -0.0001711 -0.0003531 -0.0002112 -0.3878993 -0.4294907 -0.0096185 -0.0000277 -0.0339108 -0.3497078 0.0000007 -0.0000561 -0.0000167 -0.2502473 0.9943976 0.1437917 -0.0000079 -0.4738049 -0.1701427 -0.0000218 0.0002902 0.0000222 -0.1784257 0.0666608 -0.149993 0.0000214 -0.0373653 0.418208 -0.0000143 -0.0000036 -0.0000067 -0.0224342 0.1328196 0.0381506 -0.0000181 0.0354505 -0.3429693 0.0000263 -0.0000684 0.0000037 0.0309061 -0.0880066 0.2141011 -0.0000082 0.2676992 -0.1965116 0.0000214 -0.000036 0.0000479 -0.1205126 0.0389853 0.1429846 0.0000048 0.0921155 -0.1475444 0.0000105 0.0000555 -0.0000185 0.0483004 0.1247242 -0.0252244 0.0000682 0.1029251 0.2431821 0.0000267 0.0000712 -0.0000003 -0.0549204 0.276071 0.0062728 0.0000653 -0.0988632 0.2126317 -0.0000279 0.0000646 -0.0000042 -0.0765755 0.1386296 -0.0865123 0.0000076 -0.3810922 0.1227894 -0.0000856 0.0001921 -0.0000745 -0.0436859 -0.0094003 -0.0854552 -0.0000152 -0.1358424 -0.0286407 -0.0000055 -0.0000128 0.0000014 0.1540046 0.0529683 0.0533189 -0.108445 0.0194035 0.0353137 0.0112161 -0.0907197 0.0556188 -0.0284485 -0.078156 -0.1667417 0.0000244 -0.0550688 0.0135369 0.000012 -0.0000042 0.0000093 0.1107901 0.0530251 0.0533307 0.1084117 0.0194336 0.0352872 -0.0112376 0.0906933 -0.0556224 -0.0284554 0.0228819 -0.0711047 -0.000031 -0.0746952 0.034558 -0.000016 -0.0000562 0.0000018 0.1297949 -0.1228242 0.0270099 -0.0000394 0.0439073 0.0784179 0.0000089 -0.0000168 -0.0000017 0.1396157 0.0337305 0.030462 -0.0000098 0.0638613 -0.0688719 0.0001064 -0.0000435 0.0001021 0.1824867 0.394909 -0.0304771 0.0000291 0.0408487 0.1213622 0.0001507 0.0000034 0.0001489 0.3957064 unknown
polarizability: 154.1279978|4.9423791|97.9455078|0.0052067|-0.0057384|41.8301721 unknown
InChI: InChI=1S/C7H8N2O/c1-6-2-3-8-4-7(6)5-9-10/h2-5,10H,1H3
charge 0 multiplicity 1
18 atoms
O  3.807609 0.106789 0.000055
N  -1.646937 1.722586 -0.000282
N  2.46856 0.681563 -0.000223
C  -0.832334 -1.038184 -0.000068
C  0.135047 0.018629 -0.000006
C  -2.198229 -0.662248 -0.000253
C  -0.43807 -2.504541 0.000025
C  -0.333974 1.36678 -0.000087
C  -2.560646 0.701902 -0.000375
C  1.572651 -0.286203 0.000176
H  -2.978311 -1.431746 -0.000308
H  0.163986 -2.766068 0.890791
H  -1.335167 -3.145961 0.000114
H  0.1639 -2.76618 -0.890767
H  0.393337 2.185019 0.00003
H  -3.614284 1.002739 -0.000547
H  1.902009 -1.336533 0.000616
H  4.392955 0.905556 -0.000388
