program: Gaussian 09
title: 000232500
version: EM64L-G09RevD.01
frameworkgroup: C1[X(C14H19BrO4)]
method: RPBEPBE
basis: SDD
operation: Freq
keyword: #p
keyword: freq=noraman
keyword: PBEPBE/SDD
title: #p freq=noraman PBEPBE/SDD
converged: YES YES NO NO
title: Mulliken charges:
elementType: Br O O O O C C C C C C C C C C C C C C H H H H H H H H H H H H H H H H H H H
charge: -0.010889 -0.286691 -0.278238 -0.263560 -0.261812 -0.371045 -0.242067 0.574193 -0.347296 -0.433508 0.194895 -0.232508 -0.326283 0.181111 -0.488155 -0.411982 -0.306278 -0.687711 -0.204533 0.203290 0.223267 0.182354 0.190849 0.195239 0.189216 0.252315 0.248993 0.194261 0.204756 0.207750 0.216723 0.300617 0.273756 0.210750 0.217478 0.214835 0.234057 0.241849
chargesum: 0.00000
title: Mulliken charges with hydrogens summed into heavy atoms:
elementType: Br O O O O C C C C C C C C C C C C C C
charge: -0.010889 -0.286691 -0.278238 -0.263560 -0.261812 0.055512 0.131136 0.574193 0.037159 0.067800 0.194895 0.166509 0.098191 0.181111 -0.187538 -0.411982 -0.032522 -0.044648 0.271373
polarizability: 1.79076798e+02 1.49354750e+01 1.82578229e+02 3.92170822e+01 -8.78230848e+00 1.71380896e+02
1716.lowfreq: -13.8291 -9.2014 -0.7355 -0.0009 -0.0007 -0.0005 8.9438 15.2837 19.8824
frequency: 8.4603 14.9173 17.1142 35.6144 55.0987 79.6487 86.2390 100.5952 111.4363 117.2536 139.8167 147.8364 172.2538 184.4344 228.0507 236.9276 254.6058 269.6727 285.5149 323.4878 331.7631 352.2029 406.1197 426.7389 434.8556 496.2586 514.6160 529.6150 601.2658 643.0446 676.4660 706.1562 741.2520 742.1156 789.0163 800.5961 806.4792 831.3600 834.6373 853.6071 900.0188 904.2432 925.8861 935.5699 956.5083 972.6682 979.1459 1006.5818 1037.3129 1060.0815 1069.8134 1072.3174 1075.1727 1082.2337 1095.8825 1128.4139 1128.6578 1141.9076 1146.6742 1197.2047 1203.5987 1211.4923 1247.0916 1253.3930 1270.2189 1272.7893 1279.5506 1284.2768 1332.4832 1334.6106 1353.0552 1359.1330 1364.7434 1386.5406 1389.2777 1399.5894 1401.7064 1438.5637 1446.2767 1456.9290 1461.9026 1469.9356 1474.1428 1475.7692 1482.0427 1484.3074 1492.1794 1602.4943 1621.3448 2909.0778 2919.7544 2960.5290 2964.4301 2968.0947 2974.2608 2978.6181 2986.7887 2989.3324 2997.6170 3008.2505 3048.7375 3052.7641 3072.3386 3073.4137 3074.3138 3115.3872 3183.9535 3191.1295
redmass: 4.9993 3.0370 2.8464 3.2688 4.4790 3.4660 2.9979 3.7975 2.2981 2.6596 6.2263 5.2287 4.6662 5.3613 1.1232 2.8839 6.9854 6.8244 3.5205 5.4696 6.8195 2.6067 4.0156 3.1179 2.6665 5.0276 5.8967 2.4312 6.4800 8.2721 9.2166 4.6851 6.0080 1.0817 4.9316 3.0322 1.2170 3.8605 4.4895 1.4659 1.4889 1.5309 4.6850 1.1888 2.7718 5.0686 2.8417 2.3319 3.2072 3.5737 4.0196 1.5403 2.7072 2.4246 2.9021 2.4966 1.1614 1.9627 1.4439 1.1360 1.2911 1.3519 2.7343 1.4961 1.2516 1.1912 1.1468 1.0725 1.8602 1.3051 1.4959 1.3157 1.2979 1.2197 1.9453 1.6237 3.4675 1.2248 1.1441 2.4738 1.0874 1.0677 1.0689 1.0427 1.2120 1.0702 1.0899 8.7884 9.3733 1.0557 1.0585 1.1052 1.0588 1.0754 1.0362 1.0603 1.0889 1.0593 1.0619 1.1004 1.1027 1.1040 1.1011 1.0986 1.0995 1.1092 1.0920 1.0937
irintensity: 0.0216 0.8227 0.1352 0.2862 0.5972 0.8263 8.8201 1.2285 0.5550 3.4132 5.1488 8.0337 11.5064 3.7040 0.1089 1.4135 1.5625 1.9976 1.5534 1.5175 3.3548 0.6879 1.2316 13.6394 2.6214 14.1281 7.5851 13.2042 1.0507 16.4020 1.1386 0.5971 0.2135 9.4864 30.3153 7.4576 1.4230 3.1464 31.8154 19.8215 9.1928 34.9164 27.7066 2.5963 33.7564 134.4882 43.5850 20.6319 5.3068 47.1816 84.1887 11.3604 82.7103 28.7181 32.1045 3.7635 5.1987 10.9036 1.7359 2.4190 1.5160 1.2746 102.1187 70.9636 1.2568 0.3879 4.5324 0.1093 36.1960 14.3619 9.7816 5.6558 12.4066 8.7180 41.3900 4.5304 0.7519 35.0104 42.7431 149.0822 11.4894 0.4149 1.7980 12.3604 16.5597 3.9214 15.6786 3.2995 1.3588 26.9598 104.6191 56.4822 34.7279 13.2181 29.1316 32.0798 114.3748 34.4906 124.1936 6.0270 6.3217 27.6816 98.8882 32.9313 47.7438 27.4057 3.6105 1.2710
temp: 298.150 k
press: 1.00000 atm
elementType: 35 8 8 8 8 6 6 6 6 6 6 6 6 6 6 6 6 6 6 1 1 1 1 1 1 1 1 1 1 1 1 1 1 1 1 1 1 1
symmnumber: 1
zpe: 801029.5 jmol-1
zpe.correction: 0.305096 hartree
zpe.thermalcorrener: 0.325660 hartree
zpe.thermalcorrenthalpy: 0.326604 hartree
zpe.thermalcorrgfe: 0.250379 hartree
zpe.sumelectzpe: -857.713302 hartree
zpe.sumelectthermal: -857.692739 hartree
zpe.sumelectthermalent: -857.691794 hartree
zpe.sumelectthermalfe: -857.768019 hartree
dipole: -0.0385 -0.3015 -2.7981
dipole: 2.8145
quadrupole: -113.0474 -123.0759 -118.9655
quadrupole: 6.3618 0.5138 -0.9419
quadrupole: 5.3155 -4.7130 -0.6025 6.3618 0.5138 -0.9419
hfenergy: -858.0183982 hartree
pointgroup: C01 [X(C14H19Br1O4)]
dipole: -0.1873265 -0.1677462 1.0783859 debye
polarizability: 161.0175811|-15.3489493|187.4669386|37.750086|-0.102814|184.5514034 unknown
InChI: InChI=1S/C14H19BrO4/c1-2-3-4-16-5-6-17-9-11-7-13-14(8-12(11)15)19-10-18-13/h7-8H,2-6,9-10H2,1H3
charge 0 multiplicity 1
38 atoms
Br -0.687808 -0.420383 -3.374737
O  -2.625062 1.54288 0.282218
O  -0.143931 3.256014 -0.506683
O  2.454264 -0.506199 1.891859
O  2.231853 -2.557749 0.668254
C  -3.621525 -0.660584 0.110855
C  -3.002544 0.359907 1.070071
C  0.398653 0.875671 -0.963891
C  -4.010527 -1.97943 0.818031
C  -0.222782 2.16801 -1.489923
C  1.717404 -0.289772 0.696714
C  -1.995849 2.595732 1.083982
C  -1.417307 3.636052 0.120936
C  1.589203 -1.497264 -0.020538
C  1.14075 0.898757 0.253776
C  0.29463 -0.348851 -1.665996
C  0.877395 -1.564448 -1.218792
C  -4.630232 -3.005436 -0.15542
C  2.987932 -1.887478 1.761949
H  -4.513951 -0.210642 -0.366254
H  -2.895296 -0.867869 -0.698615
H  -3.72766 0.649973 1.864711
H  -2.098201 -0.061991 1.563874
H  -3.111709 -2.420357 1.295533
H  -4.7283 -1.765999 1.636676
H  -1.27164 1.983029 -1.785749
H  0.33947 2.514202 -2.379423
H  -2.75396 3.07878 1.742887
H  -1.191039 2.176122 1.725621
H  -2.178091 3.866216 -0.65413
H  -1.177241 4.561398 0.673301
H  1.241249 1.84427 0.790923
H  0.775401 -2.495625 -1.77901
H  -5.548751 -2.603151 -0.622499
H  -3.922407 -3.253775 -0.968341
H  -4.896274 -3.9451 0.362438
H  4.057038 -1.836646 1.480058
H  2.812648 -2.430862 2.702332
