program: Gaussian 09
title: 000232504
version: EM64L-G09RevD.01
frameworkgroup: C1[X(C17H25ClO2)]
method: RPBEPBE
basis: SDD
operation: Freq
keyword: #p
keyword: freq=noraman
keyword: PBEPBE/SDD
title: #p freq=noraman PBEPBE/SDD
converged: YES YES NO NO
title: Mulliken charges:
elementType: Cl O O C C C C C C C C C C C C C C C C C H H H H H H H H H H H H H H H H H H H H H H H H H
charge: -0.029736 -0.262721 -0.257402 -0.041983 -0.420652 -0.389419 -0.393201 -0.351315 -0.356701 -0.369484 -0.357214 -0.700875 -0.697075 0.222608 0.327940 -0.266603 -0.336291 -0.218605 -0.230177 -0.212552 0.189043 0.202678 0.221638 0.220104 0.178890 0.212378 0.182763 0.235628 0.246143 0.190418 0.184397 0.212780 0.188338 0.197780 0.192507 0.209051 0.213002 0.215353 0.208602 0.210929 0.214962 0.275645 0.258879 0.240156 0.239392
chargesum: 0.00000
title: Mulliken charges with hydrogens summed into heavy atoms:
elementType: Cl O O C C C C C C C C C C C C C C C C C
charge: -0.029736 -0.262721 -0.257402 0.147060 0.003664 0.009575 0.001940 0.130456 0.018114 0.031633 0.033073 -0.063469 -0.062583 0.222608 0.327940 -0.266603 -0.060645 0.040273 0.009979 0.026840
polarizability: 2.47334777e+02 1.51251230e+00 1.78975128e+02 -7.82090521e-02 2.12645519e+01 1.74899668e+02
1716.lowfreq: -7.1419 -0.0005 0.0009 0.0018 1.6434 7.1255 11.8124 16.5162 30.0055
frequency: 10.1651 16.2995 29.9212 35.5195 39.7728 55.0164 60.5084 77.0076 97.5499 102.2510 124.0693 138.2243 141.4611 171.2816 204.2131 214.1284 230.2186 232.9089 242.0665 255.3345 259.4528 300.8360 311.4576 350.2329 411.9126 421.4647 426.7124 432.0351 474.6243 507.1189 520.9516 583.1699 634.4091 674.6184 699.1539 725.7123 737.0120 743.7707 754.5110 778.7320 806.9674 824.4318 835.5579 856.0095 881.0657 886.8504 892.2375 918.9171 939.8444 967.9077 972.1715 997.6307 1006.7615 1014.0715 1031.7760 1033.8391 1042.5832 1063.6003 1072.0596 1088.7886 1098.9312 1099.5225 1121.5902 1123.3310 1133.0808 1168.4303 1174.3662 1199.5187 1220.8598 1226.8680 1239.4379 1248.6768 1259.4882 1269.5417 1280.3110 1285.5935 1290.9732 1300.3729 1307.4937 1325.7658 1332.3117 1350.0705 1353.6305 1362.6010 1366.5941 1373.5821 1388.1193 1392.0801 1420.0514 1458.2154 1460.1816 1461.9391 1466.0304 1470.4495 1474.4975 1476.7825 1478.4503 1479.1796 1482.5584 1486.3280 1487.7787 1565.6759 1598.7896 1602.6139 2938.9640 2949.1107 2954.1262 2957.1736 2966.8904 2966.9979 2971.7638 2972.0128 2981.7258 2990.1787 3007.6687 3010.4227 3013.3396 3028.8171 3036.1082 3049.0413 3068.4433 3069.3290 3070.7840 3071.2631 3074.3745 3141.2955 3154.5699 3167.8031 3178.3004
redmass: 8.1575 4.4443 5.9934 3.9627 1.8231 2.2692 2.1823 3.5889 3.8379 4.4871 2.3981 2.2943 3.6177 2.6509 3.3551 5.7079 5.5921 1.1825 1.1042 3.1591 3.4198 6.3923 5.1514 2.9195 2.8168 6.3913 3.8223 2.9559 4.3723 3.1681 3.5377 3.3584 6.4766 4.9862 6.6532 1.0768 1.1193 2.5872 1.2206 1.6193 2.5396 3.4107 1.4970 2.1495 1.3972 1.8082 1.7202 1.9644 1.6084 1.3755 1.4058 1.3513 3.9630 7.6869 1.5942 2.4099 2.5987 2.4026 2.2602 1.9857 2.4102 2.2318 1.9004 1.8061 2.1557 2.2574 1.0593 1.5054 1.2365 1.2831 2.3035 1.2828 1.3287 1.7009 1.2215 1.1456 1.0902 1.1660 1.1963 1.3904 1.5170 1.5454 1.6130 1.6309 1.6180 4.0552 1.2187 1.2165 2.2472 1.9231 1.1659 1.1096 1.0723 1.0761 1.0639 1.0435 1.0795 1.0423 1.0797 1.0800 1.0858 6.7052 10.2579 6.8230 1.0809 1.0597 1.0596 1.0614 1.0625 1.0590 1.0367 1.0367 1.0616 1.0942 1.0967 1.0857 1.0692 1.1032 1.1011 1.1029 1.1007 1.1008 1.0993 1.0995 1.1067 1.0861 1.0904 1.0951 1.1005
irintensity: 0.1040 0.0443 2.1141 0.8237 0.1076 0.0362 0.1064 0.2681 0.5042 0.3161 0.1807 0.1892 0.7328 0.3643 1.6190 0.5495 2.7833 0.0406 0.0153 2.2991 0.2668 5.8338 0.6931 0.4966 0.9672 13.3909 0.5779 0.9460 6.5780 2.7641 0.6980 1.5139 5.9793 17.0957 13.9592 14.8672 8.8426 41.2481 4.0940 44.5551 1.5972 5.7512 7.2925 16.1134 0.2809 2.4268 6.1417 11.2612 8.0216 2.4121 1.4520 1.1497 0.7795 28.3784 2.0576 63.2838 9.7232 2.1792 5.9881 7.3551 139.5960 68.5969 7.3241 1.2449 0.3330 6.3327 1.1736 0.2941 6.5660 1.6770 221.1746 6.2011 2.0188 145.2170 2.8997 1.3677 0.8193 0.6403 0.4032 2.2423 1.8820 0.9930 0.5769 2.0844 4.3708 4.7307 10.6654 12.3130 55.2312 8.8326 0.7703 0.3486 1.0932 0.7694 4.9039 13.9184 20.3747 11.3977 7.0209 14.3116 12.7047 14.4478 208.0321 39.7729 21.2318 4.4964 18.3115 17.4362 58.9876 70.2703 51.5521 20.5447 40.7715 5.8834 2.6883 5.8716 20.3061 26.6459 31.1138 92.4511 91.5398 75.7662 57.8375 58.9289 32.8200 2.8138 4.8464 6.4370 16.2130
temp: 298.150 k
press: 1.00000 atm
elementType: 17 8 8 6 6 6 6 6 6 6 6 6 6 6 6 6 6 6 6 6 1 1 1 1 1 1 1 1 1 1 1 1 1 1 1 1 1 1 1 1 1 1 1 1 1
symmnumber: 1
zpe: 1000748.3 jmol-1
zpe.correction: 0.381165 hartree
zpe.thermalcorrener: 0.403925 hartree
zpe.thermalcorrenthalpy: 0.404869 hartree
zpe.thermalcorrgfe: 0.324367 hartree
zpe.sumelectzpe: -1271.769331 hartree
zpe.sumelectthermal: -1271.746572 hartree
zpe.sumelectthermalent: -1271.745627 hartree
zpe.sumelectthermalfe: -1271.826129 hartree
dipole: -0.7939 0.2508 -1.4465
dipole: 1.6690
quadrupole: -109.6459 -128.6845 -133.9064
quadrupole: 5.4038 8.9959 2.9579
quadrupole: 14.4330 -4.6056 -9.8274 5.4038 8.9959 2.9579
hfenergy: -1272.1504963 hartree
pointgroup: C01 [X(C17H25Cl1O2)]
dipole: -0.3139286 -0.1166328 0.5648012 debye
polarizability: 247.2956919|-2.2504989|177.4204642|0.288977|21.3544979|176.493417 unknown
InChI: InChI=1S/C17H25ClO2/c1-3-5-6-10-14(9-4-2)13-20-17(19)15-11-7-8-12-16(15)18/h7-8,11-12,14H,3-6,9-10,13H2,1-2H3
charge 0 multiplicity 1
45 atoms
Cl -0.724802 1.439913 1.483134
O  -0.363232 -0.614935 -0.630921
O  -1.800942 -0.551434 -2.456223
C  1.866474 -1.643633 -0.639994
C  2.462475 -0.513009 0.242379
C  1.435044 -2.88105 0.19508
C  2.885418 0.762966 -0.520784
C  0.709558 -1.161417 -1.526013
C  3.641779 1.767222 0.37818
C  2.587528 -3.587464 0.945724
C  4.040763 3.067269 -0.356633
C  2.130211 -4.89787 1.623107
C  4.801525 4.061597 0.546791
C  -1.570099 -0.325189 -1.239996
C  -2.603178 0.226106 -0.299782
C  -2.383409 0.958961 0.895603
C  -3.954617 -0.008442 -0.68615
C  -3.459326 1.417182 1.685818
C  -5.036255 0.434757 0.095803
C  -4.786978 1.146368 1.292127
H  2.655891 -1.971873 -1.354492
H  3.350209 -0.912888 0.77097
H  1.720751 -0.242876 1.018961
H  0.655425 -2.571941 0.919502
H  0.956761 -3.618489 -0.484305
H  1.991058 1.26739 -0.937853
H  3.529669 0.489168 -1.383993
H  0.274425 -1.985063 -2.121113
H  1.006802 -0.353135 -2.217375
H  3.006939 2.0220 1.252787
H  4.554104 1.283453 0.786691
H  3.009855 -2.910994 1.713517
H  3.4098 -3.805797 0.23287
H  3.127252 3.552779 -0.756688
H  4.666886 2.811226 -1.23613
H  1.749573 -5.619684 0.875809
H  1.315421 -4.705108 2.346372
H  2.959953 -5.38266 2.169768
H  5.733362 3.60978 0.936839
H  4.184586 4.358482 1.416053
H  5.076028 4.981189 -0.002326
H  -4.117873 -0.547147 -1.625059
H  -3.252757 1.986334 2.596581
H  -6.062852 0.230757 -0.224038
H  -5.616104 1.500799 1.913501
