program: Gaussian 09
title: 000232472
version: EM64L-G09RevD.01
frameworkgroup: C1[X(C13H26O)]
method: RPBEPBE
basis: SDD
operation: Freq
keyword: #pfreq=noraman
keyword: PBEPBE/SDD
title: #p freq=noraman PBEPBE/SDD
converged: YES YES NO NO
title: Mulliken charges:
elementType: O C C C C C C C C C C C C C H H H H H H H H H H H H H H H H H H H H H H H H H H
charge: -0.468663 0.020630 -0.509438 0.061883 -0.432604 -0.455817 -0.404007 -0.403084 -0.097523 -0.383721 -0.107075 -0.722865 -0.725900 -0.729969 0.176897 0.189429 0.235516 0.162493 0.185652 0.193604 0.200281 0.189625 0.195229 0.188018 0.189015 0.195060 0.189394 0.196808 0.187767 0.188634 0.212395 0.205395 0.212362 0.208045 0.269326 0.194154 0.233937 0.204855 0.216440 0.337823
chargesum: 0.00000
title: Mulliken charges with hydrogens summed into heavy atoms:
elementType: O C C C C C C C C C C C C C
charge: -0.130840 0.197527 -0.084493 0.224376 -0.053348 -0.065912 -0.020760 -0.019009 0.091871 0.000854 0.081559 -0.092713 -0.054374 -0.074737
polarizability: 1.58683105e+02 2.83674241e-01 1.35720421e+02 -7.98081602e-01 1.10306300e+00 1.29342970e+02
1716.lowfreq: -6.6817 -0.0003 0.0006 0.0007 9.9339 13.9537 32.5943 43.8158 50.7577
frequency: 31.5603 43.7832 50.1542 72.7080 112.8757 151.8478 166.0003 205.1162 210.7549 219.8186 229.5773 235.6013 251.4542 272.8412 290.5112 310.5203 333.5433 371.9395 386.0513 416.9343 435.9371 439.8541 489.7915 504.0158 564.0391 626.9811 735.7504 775.4995 784.9216 831.7776 838.4248 843.9082 885.8961 888.0067 906.5197 916.9300 935.7100 953.5370 956.1920 974.8920 1002.7000 1017.2065 1045.4684 1050.2496 1052.4940 1075.5708 1082.2894 1099.2140 1114.3079 1117.7798 1143.8317 1149.9265 1178.1726 1184.9266 1206.1345 1217.4207 1241.5556 1252.9482 1258.6667 1265.5479 1291.8266 1292.4622 1306.4053 1317.5720 1329.1058 1331.1588 1336.4914 1339.2212 1339.6525 1348.7667 1354.2941 1355.7958 1374.3733 1380.5787 1385.4660 1395.8118 1454.6815 1458.9323 1459.5948 1462.7072 1464.9175 1466.6911 1471.3133 1473.5733 1476.3220 1478.7727 1481.7937 1496.4688 2916.6589 2921.1850 2946.4862 2949.2364 2954.2711 2959.7624 2960.2897 2963.2490 2964.2168 2972.4758 2974.3648 2975.2541 2977.6506 3012.8244 3017.8933 3022.1916 3023.3184 3032.8930 3037.1532 3054.9268 3059.5015 3061.0575 3064.5566 3088.7064 3103.9474 3555.3521
redmass: 3.0920 2.9439 3.2087 2.6823 2.8415 3.0415 2.6825 1.0940 1.9074 1.5138 1.2051 1.7162 2.4981 1.0665 2.7533 2.1577 2.1643 2.1697 2.6016 2.2430 2.4258 2.9576 2.4353 1.9539 2.3497 2.5240 2.8942 1.5708 2.3062 2.3274 1.7126 2.5225 1.9443 1.6123 1.6986 1.2140 1.7723 2.2433 1.5685 1.5490 2.1502 2.0706 1.6747 1.6083 1.1116 1.4922 2.0457 2.3263 2.2771 1.9071 2.1706 1.8839 1.8084 1.6959 1.3121 1.2989 1.3395 1.2459 1.2557 1.3209 1.2522 1.2774 1.2731 1.3186 1.3520 1.3891 1.5375 1.5140 1.4659 1.5289 1.5149 1.3907 1.2629 1.3895 1.2399 1.2271 1.0861 1.0863 1.0888 1.0705 1.0789 1.0584 1.0615 1.0830 1.0555 1.0643 1.0495 1.0529 1.0828 1.0809 1.0803 1.0624 1.0618 1.0620 1.0619 1.0650 1.0359 1.0709 1.0485 1.0514 1.0465 1.0963 1.0996 1.0940 1.1024 1.1012 1.1030 1.0991 1.0986 1.0982 1.0986 1.0985 1.0985 1.0661
irintensity: 0.1892 0.9308 0.0003 0.6445 1.2583 0.0727 0.0628 0.3556 1.5675 1.4705 0.2207 6.5828 2.5887 124.7457 3.0939 2.4019 0.3146 1.4771 3.5016 1.0136 0.9053 2.4205 4.6123 0.2980 6.6105 4.8195 1.0187 0.4157 1.6199 2.1481 8.8253 13.7364 28.1092 4.2334 0.6981 2.1913 9.9975 5.1914 1.2293 14.8137 5.1143 8.4468 17.8781 11.4491 3.4929 2.9250 16.1040 3.0634 0.1805 2.4271 17.6833 6.9449 4.3413 13.2401 12.6253 7.6253 6.5385 0.2542 2.7052 10.0823 3.2552 5.1905 2.0690 4.2995 3.2306 0.4073 1.3154 1.1630 0.1722 1.9793 2.3415 2.2863 12.5640 8.1561 21.5898 26.5687 2.5183 5.7991 9.3850 0.1617 15.2821 13.1964 2.0339 4.3608 3.2102 11.8598 14.0175 16.1780 40.0053 27.6921 32.8567 26.1503 54.6299 30.1346 31.0053 35.1111 34.1248 6.4131 2.1148 77.7486 57.3055 92.4693 40.4453 62.0643 16.7364 18.8387 146.5720 11.1720 49.5411 48.1539 98.4346 36.6769 11.3682 3.1936
temp: 298.150 k
press: 1.00000 atm
elementType: 8 6 6 6 6 6 6 6 6 6 6 6 6 6 1 1 1 1 1 1 1 1 1 1 1 1 1 1 1 1 1 1 1 1 1 1 1 1 1 1
symmnumber: 1
zpe: 957627.2 jmol-1
zpe.correction: 0.364741 hartree
zpe.thermalcorrener: 0.381510 hartree
zpe.thermalcorrenthalpy: 0.382454 hartree
zpe.thermalcorrgfe: 0.320604 hartree
zpe.sumelectzpe: -585.029288 hartree
zpe.sumelectthermal: -585.012519 hartree
zpe.sumelectthermalent: -585.011574 hartree
zpe.sumelectthermalfe: -585.073424 hartree
dipole: -0.0907 -1.2440 1.5337
dipole: 1.9768
quadrupole: -91.3930 -84.8409 -91.9105
quadrupole: -3.5368 3.7080 -1.9411
quadrupole: -2.0116 4.5406 -2.5290 -3.5368 3.7080 -1.9411
hfenergy: -585.3940286 hartree
pointgroup: C01 [X(C13H26O1)]
dipole: 0.0717651 -0.7264972 -0.2682079 debye
polarizability: 158.6373464|0.7687715|133.0774326|-1.0113197|-3.3778777|132.0317176 unknown
InChI: InChI=1S/C13H26O/c1-10(2)13(11(3)14)9-12-7-5-4-6-8-12/h10-14H,4-9H2,1-3H3
charge 0 multiplicity 1
40 atoms
O  -2.30892 -1.387501 1.687182
C  1.192432 -0.059732 0.23687
C  -0.226587 0.461531 0.591493
C  -1.380205 -0.172575 -0.241516
C  1.697001 0.508612 -1.115914
C  2.209981 0.278165 1.357882
C  3.120166 0.011881 -1.466292
C  3.640757 -0.207741 1.020545
C  -2.598348 0.791684 -0.45138
C  4.123588 0.351825 -0.338747
C  -1.744761 -1.572049 0.326166
C  -2.27215 1.842286 -1.542933
C  -3.088295 1.485921 0.84414
C  -2.712668 -2.389851 -0.550469
H  1.156566 -1.169762 0.145994
H  -0.22697 1.561655 0.45382
H  -0.435311 0.279814 1.663591
H  -0.985521 -0.387242 -1.259789
H  1.706013 1.617828 -1.047183
H  0.994427 0.248321 -1.932163
H  1.870975 -0.167265 2.314516
H  2.222248 1.379202 1.50783
H  3.454651 0.456237 -2.424333
H  3.097876 -1.088354 -1.613946
H  3.647151 -1.317227 0.977889
H  4.342023 0.084732 1.826695
H  -3.441419 0.180386 -0.835123
H  5.127838 -0.046694 -0.58291
H  4.224702 1.454703 -0.263515
H  -0.791957 -2.143101 0.418014
H  -1.40823 2.4703 -1.251907
H  -2.027903 1.360411 -2.509096
H  -3.132673 2.517779 -1.706877
H  -2.325025 2.18222 1.239284
H  -3.310202 0.742227 1.626031
H  -4.000458 2.078165 0.638027
H  -3.712472 -1.923196 -0.58193
H  -2.831005 -3.417632 -0.155219
H  -2.332657 -2.472667 -1.585916
H  -2.510357 -2.279596 2.067993
