program: Gaussian 09
title: 000232462
version: EM64L-G09RevD.01
frameworkgroup: C1[X(C11H22)]
method: RPBEPBE
basis: SDD
operation: Freq
keyword: #p
keyword: freq=noraman
keyword: PBEPBE/SDD
title: #p freq=noraman PBEPBE/SDD
converged: YES YES NO NO
title: Mulliken charges:
elementType: C C C C C C C C C C C H H H H H H H H H H H H H H H H H H H H H H
charge: 0.045787 0.326936 -0.491140 -0.491138 0.023582 -0.441369 -0.441371 -0.748577 -0.758766 -0.748575 -0.748854 0.171958 0.197530 0.207462 0.207462 0.197529 0.192498 0.185901 0.192837 0.192837 0.185901 0.206525 0.217092 0.209314 0.219017 0.219013 0.206453 0.206526 0.209314 0.217090 0.211953 0.207320 0.211952
chargesum: 0.00000
title: Mulliken charges with hydrogens summed into heavy atoms:
elementType: C C C C C C C C C C C
charge: 0.217745 0.326936 -0.086148 -0.086147 0.216080 -0.062630 -0.062633 -0.115646 -0.114283 -0.115645 -0.117630
polarizability: 1.36672164e+02 -3.25352813e-06 1.09965191e+02 -1.92724031e-01 -1.33304395e-05 1.01330075e+02
1716.lowfreq: -40.3675 -18.0409 -0.0009 -0.0009 -0.0006 14.4681 17.0682 73.2495 164.3552
frequency: -34.2011 73.0883 164.3133 188.7059 199.6922 205.5071 227.2165 228.5545 230.7505 271.8423 290.6315 310.4686 332.5594 371.4079 415.3853 429.5632 440.9005 461.1793 494.7089 553.9600 741.0938 772.9860 783.5591 829.0136 886.2108 909.0203 913.5016 922.0379 923.3418 931.9528 951.6297 981.1122 993.5621 1010.4061 1029.1151 1048.0809 1060.6390 1088.6878 1107.9468 1133.4406 1163.1104 1196.0723 1220.2442 1228.8447 1234.7830 1249.3993 1260.1414 1293.6899 1301.4040 1304.0730 1309.9263 1331.0322 1338.6788 1346.6839 1363.8630 1370.1184 1375.6417 1385.1217 1400.0646 1456.0587 1457.5153 1461.0979 1464.2094 1465.8204 1466.9937 1472.4417 1474.5216 1475.8962 1485.5168 1485.8531 1494.5065 2913.5004 2937.5253 2949.2599 2955.9240 2963.6762 2964.4704 2967.3564 2969.3943 2972.5180 2976.5057 3011.7843 3019.2054 3035.5780 3041.4126 3055.9642 3057.1493 3059.1342 3061.7800 3064.6983 3065.8914 3072.2037 3074.1421
redmass: 2.0995 2.9261 1.6553 1.3867 1.1904 1.6035 1.2571 1.2892 1.5143 3.1205 2.3724 2.0598 2.2819 2.0241 1.8118 2.6059 2.4603 3.0190 2.1106 2.5074 2.8888 2.5903 1.4900 2.0433 1.5612 1.5104 1.9275 1.7018 1.8255 1.2092 1.4233 2.1688 1.5564 1.4052 1.4670 2.0316 1.0876 2.0734 2.5527 2.1087 1.8860 2.1485 1.8024 1.8076 1.8575 1.5172 1.6633 1.4266 1.3060 1.3412 1.2625 1.4344 1.5521 1.6121 1.5531 1.2072 1.2034 1.2226 1.2100 1.0823 1.0685 1.0674 1.0500 1.0830 1.0565 1.0804 1.0580 1.0601 1.0520 1.0609 1.0584 1.0821 1.0800 1.0612 1.0615 1.0382 1.0368 1.0354 1.0607 1.0480 1.0511 1.0980 1.0978 1.1002 1.1002 1.0994 1.0990 1.0989 1.0992 1.0979 1.0996 1.0979 1.0982
irintensity: 0.0175 0.0434 0.0201 0.0201 0.0483 0.0311 0.0573 0.0188 0.0176 0.0036 0.0507 0.0851 0.0283 0.3098 0.2365 0.0930 0.2065 0.0522 0.4931 0.6028 0.9546 0.4864 0.0036 2.7059 5.6043 2.8887 0.0398 2.5922 3.8117 0.0446 0.7698 13.6080 2.5678 0.8943 4.7413 1.3764 0.2922 3.8704 0.8123 0.2958 0.2199 4.2878 1.7113 4.9530 19.1094 1.6878 5.2077 0.0880 0.3434 5.6958 0.0659 0.0036 1.3054 0.8503 6.3952 21.9683 27.1849 9.5174 16.8219 0.0275 5.8747 1.6423 3.8617 7.8258 1.3968 8.6879 11.8612 7.0490 9.1355 5.4695 31.7201 23.1053 3.7922 34.2825 43.0816 82.6630 19.5368 42.0818 21.8481 0.6454 50.9284 67.7367 39.1695 24.3041 68.7949 0.1487 59.4753 56.8861 41.4080 98.8298 11.6768 57.1648 71.5985
temp: 298.150 k
press: 1.00000 atm
elementType: 6 6 6 6 6 6 6 6 6 6 6 1 1 1 1 1 1 1 1 1 1 1 1 1 1 1 1 1 1 1 1 1 1
symmnumber: 1
zpe: 798089.6 jmol-1
zpe.correction: 0.303976 hartree
zpe.thermalcorrener: 0.316246 hartree
zpe.thermalcorrenthalpy: 0.317190 hartree
zpe.thermalcorrgfe: 0.267428 hartree
zpe.sumelectzpe: -431.454016 hartree
zpe.sumelectthermal: -431.441746 hartree
zpe.sumelectthermalent: -431.440802 hartree
zpe.sumelectthermalfe: -431.490564 hartree
dipole: 0.0391 0.0000 0.0225
dipole: 0.0451
quadrupole: -73.6041 -72.8029 -72.0437
quadrupole: 0.0000 -0.3864 0.0000
quadrupole: -0.7872 0.0140 0.7732 0.0000 -0.3864 0.0000
hfenergy: -431.757992 hartree
pointgroup: C01 [X(C11H22)]
dipole: 0.0152594 0. 0.0090877 debye
polarizability: 136.669496|0.0002277|109.9651911|0.3625425|0.0000346|101.332743 unknown
InChI: InChI=1S/C11H22/c1-9-5-7-10(8-6-9)11(2,3)4/h9-10H,5-8H2,1-4H3
charge 0 multiplicity 1
33 atoms
C  0.501817 0.000009 -0.294074
C  2.051006 0.000035 0.011416
C  -0.243346 -1.264102 0.216749
C  -0.243354 1.264103 0.216774
C  -2.481966 0.0000 0.289492
C  -1.734319 -1.26439 -0.199825
C  -1.734323 1.264395 -0.199814
C  2.713499 1.254625 -0.626507
C  2.348744 -0.000065 1.535679
C  2.713625 -1.254392 -0.626703
C  -3.958681 0.000002 -0.158721
H  0.414232 0.000025 -1.406091
H  -0.180225 -1.307634 1.323806
H  0.240357 -2.181009 -0.168599
H  0.240358 2.181023 -0.168538
H  -0.180248 1.307599 1.323832
H  -2.453393 -0.000005 1.401899
H  -1.805487 -1.312626 -1.307812
H  -2.235074 -2.173114 0.190781
H  -2.23508 2.173114 0.190799
H  -1.805483 1.312642 -1.307801
H  3.813931 1.201624 -0.5225
H  2.380965 2.191239 -0.144494
H  2.478012 1.323048 -1.706128
H  1.932662 -0.894508 2.03432
H  1.932674 0.894318 2.034435
H  3.441616 -0.000083 1.709832
H  3.814059 -1.201238 -0.522787
H  2.478055 -1.322732 -1.706312
H  2.381277 -2.191106 -0.144761
H  -4.493242 0.894328 0.213817
H  -4.03253 0.000012 -1.263867
H  -4.493239 -0.894334 0.2138
