program: Gaussian 09
title: 000004314
version: EM64L-G09RevD.01
frameworkgroup: C1[X(C16H22N2O2S)]
method: RPBEPBE
basis: SDD
operation: Freq
keyword: #p
keyword: freq=noraman
keyword: PBEPBE/SDD
title: #p freq=noraman PBEPBE/SDD
converged: YES YES NO NO
title: Mulliken charges:
elementType: S O O N N C C C C C C C C C C C C C C C C H H H H H H H H H H H H H H H H H H H H H H
charge: 0.974796 -0.535461 -0.527565 -0.510246 -0.570659 -0.346210 -0.397920 -0.356529 -0.378328 -0.361630 -0.250503 0.394379 -0.389443 0.407874 -0.268505 -0.401617 -0.432042 -0.240249 -0.415394 -0.248605 -0.236181 0.235752 0.190484 0.196362 0.208635 0.180733 0.185602 0.255763 0.220732 0.181739 0.223371 0.299650 0.204998 0.174856 0.304150 0.288981 0.246525 0.243594 0.244503 0.237302 0.271058 0.259312 0.235933
chargesum: 0.00000
title: Mulliken charges with hydrogens summed into heavy atoms:
elementType: S O O N N C C C C C C C C C C C C C C C C
charge: 0.974796 -0.535461 -0.527565 -0.210596 -0.040290 0.080026 0.007078 0.009806 0.098167 0.043481 -0.250503 0.394379 -0.009588 0.407874 0.035645 -0.112636 -0.185517 0.003344 -0.170891 -0.011303 -0.000247
polarizability: 2.68350803e+02 2.26842243e+01 2.30860940e+02 -2.88329246e+01 2.04690928e+01 1.74116469e+02
1716.lowfreq: -5.4997 -3.1433 -0.0018 -0.0014 -0.0009 7.2764 9.9032 17.4402 29.2657
frequency: 9.8689 17.3499 29.2106 39.2272 42.5512 73.4600 87.6080 105.4787 108.9984 130.9083 137.4858 149.5238 177.9526 186.3810 218.1586 221.8751 236.2185 241.0551 255.9748 261.3389 308.1065 328.1085 384.2322 396.7452 414.6545 426.0643 447.8415 460.6152 470.9400 510.1781 522.9371 524.7995 544.3677 596.6888 626.3145 639.9235 727.9652 733.9148 751.7457 760.1307 780.2662 782.5765 785.3466 817.1364 820.7020 822.1989 874.3674 888.4288 916.0301 923.3890 940.6076 942.6828 959.1189 971.7605 991.6476 994.5482 1000.9303 1015.9315 1029.1347 1058.4241 1065.5511 1066.5665 1086.6551 1096.7972 1119.2378 1127.4372 1141.1892 1159.6995 1177.4921 1194.3563 1195.4634 1203.6913 1236.2009 1245.9291 1259.8607 1274.3907 1280.8926 1289.1131 1293.3226 1310.7552 1327.2634 1347.0970 1353.3938 1364.3191 1368.0767 1387.6268 1395.8973 1413.3116 1433.1223 1446.9377 1459.3533 1465.6651 1470.1307 1480.6738 1484.9885 1493.8128 1505.2039 1570.2104 1596.7692 1633.8020 1637.7490 2855.7265 2930.9572 2947.9220 2960.4666 2962.8344 2975.7641 2995.0017 3004.3903 3011.9897 3041.6234 3051.3052 3058.0648 3127.2324 3132.6884 3133.7693 3147.4907 3148.6815 3166.2233 3167.6247 3402.8710 3451.9150 3579.9644
redmass: 5.9331 5.0386 3.9905 2.3890 2.7287 3.3345 4.4337 4.1127 2.0041 2.6278 3.6148 4.4181 4.1950 3.4460 2.6935 2.0755 6.2523 3.1324 3.5225 2.6671 4.2493 4.5160 3.9450 3.6717 4.5057 5.4441 4.1001 3.4750 3.4464 7.1955 7.1400 2.5076 3.6681 1.2874 3.4383 6.5554 1.8683 1.0767 1.3284 1.1580 4.3464 2.2484 5.5888 3.6294 1.4459 1.5997 1.9782 1.6136 1.6023 5.8428 1.3808 4.9464 2.0584 1.3943 1.7132 1.3964 1.3659 3.9184 2.4637 1.9497 2.0706 2.8904 2.2362 2.8860 2.1082 2.0713 1.5952 1.3064 1.1385 1.3852 1.2190 1.5542 1.8631 1.2820 1.3478 1.6222 1.0479 1.1773 1.0945 1.3147 1.2209 1.3605 1.4755 1.7295 1.4108 1.4667 4.2368 5.0218 2.5100 2.2717 1.0807 1.0661 1.0845 1.0784 1.0934 1.0914 3.4372 7.6037 5.5418 6.8140 1.0944 1.0717 1.0663 1.0590 1.0657 1.0618 1.0668 1.0929 1.0853 1.0978 1.1002 1.0955 1.1007 1.0868 1.0885 1.0894 1.0913 1.0947 1.1004 1.0988 1.0757 1.0447 1.0975
irintensity: 0.8383 0.4524 1.3474 1.3265 1.4565 1.6662 2.7441 1.2043 0.9302 4.3446 2.0920 2.1116 3.3020 0.9493 1.9176 14.9616 1.9696 19.7695 23.0261 13.3760 8.6606 24.6258 2.5365 4.4503 10.4681 35.9638 39.7516 150.6191 33.5834 7.1730 2.7208 5.8011 6.8034 220.4308 2.4293 5.7162 15.2537 11.6690 2.1644 0.2665 1.0265 69.5086 2.2242 76.9873 65.2795 51.3032 9.3187 0.6871 1.8492 4.3447 0.2039 48.2699 7.6362 2.6977 12.6966 5.5533 0.0687 7.1839 7.5033 3.9364 0.9518 5.5262 2.2201 5.6974 14.6857 4.5934 43.0928 1.0124 2.5885 4.5321 9.0199 3.2438 6.3642 2.1207 2.0485 12.8323 6.5072 3.5783 2.9075 1.5714 0.2880 4.6953 0.7393 20.3461 5.6386 15.5223 8.0864 0.1466 0.4884 6.9240 3.6102 0.0253 0.2121 22.0151 11.3564 7.5547 20.6093 1.3741 2.9198 2.6186 41.1637 116.8304 33.9450 18.4432 27.4367 27.5276 49.9482 26.0880 36.5859 15.8036 17.9127 14.4669 104.0667 0.3411 0.7473 12.5790 6.1929 9.4058 30.6811 22.2205 12.4997 2.1971 0.2164
temp: 298.150 k
press: 1.00000 atm
elementType: 16 8 8 7 7 6 6 6 6 6 6 6 6 6 6 6 6 6 6 6 6 1 1 1 1 1 1 1 1 1 1 1 1 1 1 1 1 1 1 1 1 1 1
symmnumber: 1
zpe: 923138.1 jmol-1
zpe.correction: 0.351605 hartree
zpe.thermalcorrener: 0.374022 hartree
zpe.thermalcorrenthalpy: 0.374966 hartree
zpe.thermalcorrgfe: 0.296328 hartree
zpe.sumelectzpe: -1279.148559 hartree
zpe.sumelectthermal: -1279.126142 hartree
zpe.sumelectthermalent: -1279.125198 hartree
zpe.sumelectthermalfe: -1279.203837 hartree
dipole: 2.0952 2.8466 -6.9445
dipole: 7.7922
quadrupole: -104.3475 -128.2843 -146.2816
quadrupole: 5.2837 -0.1462 9.0507
quadrupole: 21.9570 -1.9798 -19.9771 5.2837 -0.1462 9.0507
hfenergy: -1279.500164 hartree
pointgroup: C01 [X(C16H22N2O2S1)]
dipole: -0.8602763 0.9249139 2.793387 debye
polarizability: 269.3244506|-20.1760941|232.9512059|-29.1984751|-16.9574519|171.0525558 unknown
InChI: InChI=1S/C16H22N2O2S/c17-12-5-1-2-6-13-18-21(19,20)16-11-7-9-14-8-3-4-10-15(14)16/h3-4,7-11,18H,1-2,5-6,12-13,17H2
charge 0 multiplicity 1
43 atoms
S  -0.508477 -0.958634 -1.393762
O  0.002947 -2.50057 -1.379843
O  -0.706148 -0.123589 -2.773738
N  0.761273 -0.018952 -0.447161
N  8.596211 0.544369 -0.395894
C  3.668591 -0.237203 0.445521
C  2.453011 0.075117 1.344001
C  4.952611 0.485778 0.909599
C  1.139639 -0.590102 0.868529
C  6.175632 0.16921 0.020599
C  -2.121428 -0.924564 -0.351997
C  -2.902913 0.270378 -0.229232
C  7.462481 0.876974 0.491113
C  -4.047312 0.193639 0.667578
C  -2.417623 -2.121252 0.288652
C  -2.638463 1.503895 -0.915168
C  -4.347466 -1.040759 1.334178
C  -3.56153 -2.177979 1.144488
C  -4.858031 1.360303 0.859676
C  -3.452384 2.618542 -0.698865
C  -4.564526 2.553236 0.197832
H  3.429202 0.044365 -0.5971
H  3.843328 -1.333021 0.439657
H  2.308475 1.173903 1.411679
H  2.646541 -0.27676 2.378122
H  5.177045 0.206414 1.961322
H  4.776417 1.582441 0.90992
H  1.304234 -1.672206 0.716241
H  0.345863 -0.461163 1.637497
H  6.3453 -0.929002 0.010669
H  5.976662 0.466421 -1.026804
H  0.471048 0.974384 -0.43305
H  7.305811 1.972745 0.44786
H  7.636697 0.620424 1.566994
H  -1.778856 -2.995889 0.125164
H  -1.830447 1.546128 -1.653374
H  -5.218115 -1.078302 1.999333
H  -3.80757 -3.117169 1.649596
H  -5.718626 1.296527 1.535865
H  -3.24663 3.550986 -1.235401
H  9.446153 1.09071 -0.226099
H  8.793019 -0.460386 -0.45267
H  -5.190548 3.438513 0.35137
