program: Gaussian 09
title: 000232388
version: EM64L-G09RevD.01
frameworkgroup: C1[X(C13H15NO4)]
method: RPBEPBE
basis: SDD
operation: Freq
keyword: #p
keyword: freq=noraman
keyword: PBEPBE/SDD
title: #p freq=noraman PBEPBE/SDD
converged: YES YES NO NO
title: Mulliken charges:
elementType: O O O O N C C C C C C C C C C C C C H H H H H H H H H H H H H H H
charge: -0.291118 -0.414090 -0.217666 -0.311414 -0.182461 -0.149737 -0.467479 -0.466770 -0.347363 0.183931 0.321318 -0.471788 0.487985 -0.359691 -0.411717 -0.225274 -0.224065 -0.235469 0.303865 0.239689 0.247684 0.245974 0.233449 0.257328 0.229409 0.246030 0.218631 0.379340 0.271030 0.229888 0.227373 0.225312 0.227865
chargesum: 0.00000
title: Mulliken charges with hydrogens summed into heavy atoms:
elementType: O O O O N C C C C C C C C C C C C C
charge: -0.291118 -0.034751 -0.217666 -0.311414 -0.182461 0.154128 0.019895 0.012653 0.139373 0.183931 0.321318 -0.007127 0.487985 -0.088661 -0.181829 0.002100 0.001247 -0.007605
polarizability: 1.85078547e+02 6.62753981e-01 1.54413327e+02 2.03263519e+01 9.21946294e-01 1.18212593e+02
1716.lowfreq: -11.0858 -4.6902 0.0004 0.0006 0.0007 5.4922 19.8370 24.0409 35.6459
frequency: 19.5314 23.9571 35.3982 42.3586 64.2669 85.4399 121.1079 135.2057 160.3015 168.0182 240.3593 252.8599 284.6428 310.5126 338.6618 388.5134 403.1134 407.2538 482.7888 526.7390 552.6410 583.7774 599.0453 617.3765 620.3821 688.0744 699.4939 706.1106 714.3954 755.3666 786.8002 814.0727 828.5204 858.8832 864.8410 891.4493 907.4094 916.2456 932.5321 976.8264 979.1637 982.7985 989.9654 1001.4974 1026.0317 1030.2562 1041.8789 1067.6280 1091.2303 1101.8157 1154.6565 1166.6861 1172.7520 1189.6082 1196.3472 1221.8410 1228.8485 1241.4915 1250.3148 1267.8433 1301.5093 1317.0063 1324.1304 1330.2471 1346.9331 1359.7109 1381.8048 1387.5465 1442.3995 1461.9101 1468.7523 1473.6336 1484.5747 1493.9210 1594.2557 1615.1039 1634.1180 1671.4578 2995.4897 3021.3047 3024.6327 3029.4717 3063.1658 3073.9000 3089.9573 3102.8599 3103.5767 3117.0926 3126.8070 3138.4976 3149.4927 3163.9460 3516.9300
redmass: 4.4046 6.1889 4.3559 8.0248 5.1845 6.9684 3.6205 4.5375 3.3797 5.0555 4.2110 2.8657 4.3776 5.6772 3.2593 5.7169 2.8387 3.0350 4.1951 3.7867 2.3539 2.5131 2.9018 5.9535 2.0991 4.9477 4.8243 2.3053 4.0917 2.1491 2.5435 3.5935 5.2394 1.2527 1.9545 2.6655 2.0734 2.6738 1.5375 2.1642 1.7648 1.4243 5.8617 1.3379 2.4133 3.0993 2.6395 1.8597 1.5279 1.9642 1.4513 1.5380 1.0546 1.1211 2.3260 2.7878 1.2898 1.1725 1.6202 1.7884 1.3218 1.7601 1.3160 1.2680 1.4960 1.5634 3.8698 4.5385 2.1828 1.1303 1.0854 1.0927 2.2932 1.0872 6.0965 6.0852 10.4512 8.7927 1.0655 1.0630 1.0629 1.0586 1.0861 1.0983 1.1022 1.1054 1.1068 1.0868 1.0871 1.0919 1.0964 1.1016 1.0641
irintensity: 0.3197 1.1733 0.9642 1.7307 0.2278 5.2885 0.2403 0.5148 0.7486 1.3424 4.6476 6.6939 0.7091 0.6980 1.4161 28.4187 1.1867 3.8858 9.8620 40.9923 21.9389 50.3854 11.1856 0.9084 60.9761 27.5619 9.7872 76.5890 10.1811 50.8820 2.1894 7.9137 10.7860 0.5947 7.8874 71.2536 98.5360 2.6748 4.2881 34.2293 1.9564 1.1583 0.1791 0.5597 32.8849 47.6276 337.7321 47.6647 10.9822 40.9775 8.3925 14.5171 0.2117 2.0079 9.4943 28.8332 20.1438 3.0405 15.8231 18.9826 2.7097 180.0871 1.9719 2.6011 36.5323 27.2654 174.1922 89.5347 8.1085 46.2337 9.3509 12.0851 14.1902 5.0623 3.7697 3.4341 354.6435 185.3695 36.9356 22.4823 24.3819 35.3631 9.6962 11.0227 20.1910 34.2173 8.6782 7.1918 2.3155 17.7936 26.8337 24.7426 26.5405
temp: 298.150 k
press: 1.00000 atm
elementType: 8 8 8 8 7 6 6 6 6 6 6 6 6 6 6 6 6 6 1 1 1 1 1 1 1 1 1 1 1 1 1 1 1
symmnumber: 1
zpe: 687936.9 jmol-1
zpe.correction: 0.262021 hartree
zpe.thermalcorrener: 0.278678 hartree
zpe.thermalcorrenthalpy: 0.279622 hartree
zpe.thermalcorrgfe: 0.214421 hartree
zpe.sumelectzpe: -858.716781 hartree
zpe.sumelectthermal: -858.700124 hartree
zpe.sumelectthermalent: -858.699180 hartree
zpe.sumelectthermalfe: -858.764381 hartree
dipole: 1.8788 -1.6284 -1.5329
dipole: 2.9208
quadrupole: -86.5262 -92.6755 -109.8356
quadrupole: 0.5079 -0.9053 -0.7858
quadrupole: 9.8196 3.6702 -13.4898 0.5079 -0.9053 -0.7858
hfenergy: -858.978802 hartree
pointgroup: C01 [X(C13H15N1O4)]
dipole: 0.6399923 -0.9387257 0.1724633 debye
polarizability: 189.0459013|9.5192103|126.8335397|6.5715738|-18.6228543|141.8250257 unknown
InChI: InChI=1S/C13H15NO4/c15-12(16)11-7-4-8-14(11)13(17)18-9-10-5-2-1-3-6-10/h1-3,5-6,11,15H,4,7-9H2
charge 0 multiplicity 1
33 atoms
O  -0.477098 -0.34395 1.511167
O  3.738515 1.166501 -1.818214
O  1.83127 -0.10931 -2.19714
O  0.649766 1.574006 0.701316
N  1.631959 -0.545394 0.657149
C  2.887619 -0.064167 0.06472
C  3.832767 -1.29453 0.221715
C  2.864664 -2.502449 0.114089
C  1.584598 -2.019517 0.839774
C  2.709866 0.305573 -1.415386
C  0.610628 0.330759 0.926065
C  -1.677063 0.511187 1.804474
C  -2.700621 0.429906 0.692612
C  -2.500131 1.141584 -0.519554
C  -3.872117 -0.352285 0.848997
C  -3.454669 1.06347 -1.556531
C  -4.831477 -0.425948 -0.186497
C  -4.623346 0.281788 -1.392699
H  3.264157 0.830268 0.587358
H  4.299107 -1.25496 1.222449
H  4.63547 -1.304151 -0.533003
H  2.637739 -2.713937 -0.945516
H  3.279221 -3.417133 0.569068
H  0.659472 -2.430705 0.403969
H  1.596654 -2.270605 1.917553
H  -1.318458 1.544589 1.955196
H  -2.065581 0.094667 2.74744
H  3.625868 1.38951 -2.781755
H  -1.592919 1.744527 -0.641167
H  -4.032539 -0.905777 1.782819
H  -3.290154 1.612793 -2.49023
H  -5.735039 -1.031721 -0.054146
H  -5.364832 0.22531 -2.197796
