program: Gaussian 09
title: 000232379
version: EM64L-G09RevD.01
frameworkgroup: C1[X(C9H9BrClNO2)]
method: RPBEPBE
basis: SDD
operation: Freq
keyword: #p
keyword: freq=noraman
keyword: PBEPBE/SDD
title: #p freq=noraman PBEPBE/SDD
converged: NO YES NO NO
title: Mulliken charges:
elementType: Br Cl O O N C C C C C C C C C H H H H H H H H H
charge: 0.007521 -0.052045 -0.300830 -0.269149 -0.459939 0.490738 -0.434923 -0.342262 -0.177432 -0.150609 -0.160760 -0.237615 0.269616 -0.589025 0.233193 0.305714 0.336891 0.235845 0.256561 0.251426 0.250531 0.261494 0.275058
chargesum: 0.00000
title: Mulliken charges with hydrogens summed into heavy atoms:
elementType: Br Cl O O N C C C C C C C C C
charge: 0.007521 -0.052045 -0.300830 -0.269149 -0.123047 0.490738 -0.201730 -0.036548 0.314974 0.100817 0.089771 -0.237615 0.269616 -0.052473
polarizability: 2.35947728e+02 4.72131431e+00 1.20911088e+02 5.25371318e+00 -5.20189331e+00 6.88867432e+01
1716.lowfreq: -7.1513 -1.0806 0.0002 0.0008 0.0027 5.5704 12.4112 34.9720 47.6773
frequency: 8.8832 34.9262 47.6543 69.9788 80.7701 116.3499 161.6701 179.5766 204.7512 265.6249 269.7419 322.6230 357.9481 384.7123 410.3840 431.0744 509.2624 609.2899 619.6088 634.2581 645.5541 698.9111 706.3959 710.7871 798.8371 817.4538 845.4897 855.4295 941.3770 944.5290 968.8653 981.3179 989.6635 1015.2144 1063.5799 1089.2594 1120.0278 1162.2974 1176.4406 1190.7538 1224.6230 1262.7592 1298.3722 1300.0981 1359.3524 1375.3840 1401.9401 1436.9456 1459.2466 1475.3071 1513.7576 1592.4715 1607.5436 1663.5253 2996.2208 3063.0582 3076.9556 3126.2385 3147.4420 3165.2571 3173.3259 3190.2706 3539.0200
redmass: 8.0981 6.8861 9.1726 7.1100 5.6330 7.2007 5.6867 7.0589 7.4413 3.2717 4.4207 5.6352 5.5545 5.7692 2.9890 3.4967 2.7398 4.9104 7.0699 6.6959 1.3730 4.5483 3.6845 5.0472 3.9467 1.3889 1.4075 3.4015 2.4319 1.3584 2.5647 1.3243 4.6177 2.5902 2.4852 2.7781 1.3518 3.0531 1.2233 1.1101 1.1644 2.1009 1.2782 1.2447 1.9529 2.6525 3.6861 1.1085 1.0844 2.2840 2.3750 5.1905 6.1322 8.6673 1.0613 1.0633 1.0961 1.0903 1.1099 1.0906 1.0952 1.0958 1.0762
irintensity: 1.6921 2.4017 0.7699 2.4922 4.3975 1.0974 4.3067 2.1749 2.6594 8.6001 11.9913 0.0214 3.2975 2.9690 0.0015 24.5665 41.7934 20.1005 8.6633 15.7141 34.8266 43.7867 3.3685 15.2335 1.3055 44.6124 59.8014 1.3572 6.1400 1.8445 114.0337 2.5624 49.1002 129.2871 53.6380 97.9521 31.3868 430.2276 40.7499 12.3692 5.5857 4.8224 22.4509 15.6856 87.1310 31.2499 36.5417 14.1808 38.0389 64.2564 637.4492 40.7350 50.4680 258.4521 23.9617 13.9227 17.1878 13.3592 9.8655 3.4706 3.3246 5.4562 35.6883
temp: 298.150 k
press: 1.00000 atm
elementType: 35 17 8 8 7 6 6 6 6 6 6 6 6 6 1 1 1 1 1 1 1 1 1
symmnumber: 1
zpe: 435981.3 jmol-1
zpe.correction: 0.166057 hartree
zpe.thermalcorrener: 0.180033 hartree
zpe.thermalcorrenthalpy: 0.180977 hartree
zpe.thermalcorrgfe: 0.120593 hartree
zpe.sumelectzpe: -1026.061307 hartree
zpe.sumelectthermal: -1026.047330 hartree
zpe.sumelectthermalent: -1026.046386 hartree
zpe.sumelectthermalfe: -1026.106770 hartree
dipole: 2.4450 -0.4614 2.0557
dipole: 3.2275
quadrupole: -99.9371 -94.3697 -99.4294
quadrupole: 9.7354 9.0619 -2.3764
quadrupole: -2.0250 3.5423 -1.5173 9.7354 9.0619 -2.3764
hfenergy: -1026.2273632 hartree
pointgroup: C01 [X(C9H9Br1Cl1N1O2)]
dipole: -0.9587524 -0.2899177 -0.7804399 debye
dipolederiv: -0.8120054 -0.0339686 -0.0433607 -0.0565319 -0.0699139 -0.0078968 -0.0500941 -0.006871 -0.041842 -0.2658622 -0.0705986 0.0342139 -0.1660302 -0.3539603 0.1381894 0.1180756 0.1787513 -0.3191266 -2.3077053 -0.0375211 -0.0583727 -0.2793962 -0.4485986 -0.0457458 -0.2018722 -0.0467046 -0.3074223 -0.8036536 -0.0153874 -0.0083615 0.2709339 -0.9470322 -0.0897226 -0.0027473 -0.1091065 -0.3478494 -2.119418 0.2877701 -0.0141254 0.7231661 -0.4755582 -0.0026933 0.0232378 -0.0183864 -0.3281244 1.5568305 -0.0611177 0.0505425 0.2194095 -0.0056838 -0.0099517 0.1162275 -0.0209325 0.1091551 -0.2704673 0.0091352 0.0021501 0.1368316 0.0331007 0.0455114 0.0163496 0.0355684 -0.1951858 -0.2710858 0.0155399 -0.0005015 -0.1539071 -0.0394868 0.0134932 -0.031075 0.0219271 -0.1596051 1.0510831 -0.1111766 -0.0348663 -0.5356732 0.1600167 0.0269637 0.0062683 0.0413637 0.2324327 -0.2582271 -0.0552229 -0.0174668 -0.0683691 0.0667431 0.0191962 -0.0202717 0.019427 -0.0756413 -0.2749159 0.0255231 -0.0057561 0.0156886 0.0897734 0.0265907 -0.0079577 0.0288643 -0.0754878 1.2744351 0.0911115 0.087913 0.1082826 -0.0624257 0.0191579 0.0935995 0.0186517 -0.1411061 2.907618 -0.1413736 0.0579719 -0.5886185 1.3961594 0.1534454 0.1008548 0.1846347 0.3428521 0.1965558 0.1053791 -0.0969309 0.217509 0.4597922 -0.2695072 -0.1730854 -0.2647096 0.4167699 -0.0055054 -0.1027517 -0.0263587 -0.0874323 -0.0369967 -0.0376807 -0.0237563 -0.0377054 0.1633931 0.1485267 0.0431558 0.0024723 0.0188887 0.0691262 -0.0177544 0.0006169 -0.0155264 0.1776707 0.2021362 0.0399723 -0.0026283 -0.0043094 0.1634655 -0.0212069 -0.0085696 -0.0188304 0.3222317 -0.064439 -0.0552472 0.0463003 0.1049884 -0.0159941 0.0950967 -0.0258171 0.0916963 0.0054691 -0.0380606 -0.0012369 -0.0208907 0.1167307 0.0593754 -0.0486426 0.0182132 -0.0830355 -0.0461028 0.0425541 0.0750544 0.0061659 0.0760326 0.0039367 -0.0210223 0.0058601 -0.0206135 0.1580687 0.0630598 -0.0554954 -0.0135928 -0.0652957 -0.0115816 -0.0299811 -0.0152301 -0.0297565 0.1507742 -0.0747159 0.0534327 0.008345 0.0556182 -0.0278243 0.0746606 0.0373546 0.0585605 0.054659 0.1232622 -0.0049765 0.0471374 -0.0585163 -0.0064331 -0.0105 0.0238188 -0.0072665 -0.0959828 unknown
polarizability: 236.1951299|0.2516018|121.2649341|4.0402248|0.7425738|68.2854944 unknown
InChI: InChI=1S/C9H9BrClNO2/c10-7-1-3-8(4-2-7)12-9(13)14-6-5-11/h1-4,12H,5-6H2
charge 0 multiplicity 1
23 atoms
Br 5.736414 0.092106 0.209515
Cl -5.352265 -1.329752 0.963225
O  -2.654208 -0.125077 -0.314251
O  -1.270881 1.735688 0.10816
N  -0.424942 -0.461438 -0.215352
C  0.979914 -0.282248 -0.108319
C  1.801122 -1.432639 -0.245989
C  1.578408 0.983522 0.126501
C  -3.827788 0.760625 -0.158081
C  3.203462 -1.329128 -0.152858
C  2.982655 1.086531 0.218835
C  3.78271 -0.064617 0.078796
C  -1.407236 0.506695 -0.114702
C  -5.068299 -0.071798 -0.41075
H  1.348276 -2.41531 -0.425884
H  0.950213 1.869695 0.23657
H  -0.770975 -1.410076 -0.377788
H  -3.76508 1.57856 -0.903151
H  -3.822549 1.209279 0.850479
H  3.828769 -2.219698 -0.259375
H  3.442603 2.062068 0.399801
H  -5.965968 0.564794 -0.419893
H  -4.992052 -0.653982 -1.340291
