program: Gaussian 09
title: 000232376
version: EM64L-G09RevD.01
frameworkgroup: C1[X(C12H11NO3)]
method: RPBEPBE
basis: SDD
operation: Freq
keyword: #p
keyword: freq=noraman
keyword: PBEPBE/SDD
title: #p freq=noraman PBEPBE/SDD
converged: YES YES NO NO
title: Mulliken charges:
elementType: O O O N C C C C C C C C C C C C H H H H H H H H H H H
charge: -0.301143 -0.230152 -0.284168 -0.457917 -0.423382 0.360909 0.476655 -0.372555 -0.440401 -0.356200 -0.259151 0.283900 -0.195410 -0.209973 -0.162910 -0.256807 0.253710 0.243569 0.282346 0.331032 0.223152 0.298131 0.254579 0.226806 0.226301 0.259944 0.229134
chargesum: 0.00000
title: Mulliken charges with hydrogens summed into heavy atoms:
elementType: O O O N C C C C C C C C C C C C
charge: -0.301143 -0.230152 -0.284168 -0.126885 0.073897 0.360909 0.476655 -0.090209 -0.217249 -0.058068 -0.004572 0.283900 0.031396 0.016327 0.097034 -0.027673
polarizability: 2.04972004e+02 -8.86433850e+00 1.29258327e+02 -3.15116140e+00 -1.45441425e+01 1.01169805e+02
1716.lowfreq: -4.2699 -0.0006 0.0002 0.0005 3.2910 3.5591 26.6493 31.3434 45.6212
frequency: 26.6361 31.3340 45.6050 73.8873 83.8531 123.5613 165.2112 239.0504 249.5133 271.8062 323.3599 352.0917 408.4484 430.5452 509.0655 592.4791 596.7151 613.0150 633.0342 641.5990 664.6676 694.3737 697.9455 725.9357 736.8952 766.0391 812.1925 835.2479 841.1689 868.8206 874.0837 877.2382 890.0314 913.4659 955.6037 968.9537 971.9232 985.4574 995.9617 1020.2981 1029.1242 1048.3399 1090.2312 1136.4551 1158.5582 1172.9140 1185.5694 1190.3823 1226.9378 1257.3451 1273.5941 1325.8907 1345.5401 1369.1241 1386.5957 1432.7064 1434.3387 1477.3972 1486.2596 1515.4986 1588.3632 1601.5546 1617.2988 1662.3635 3051.7330 3115.4392 3130.9040 3132.8617 3144.7993 3165.8272 3189.6536 3223.2350 3239.9157 3267.2482 3540.7578
redmass: 6.2797 4.1824 4.4951 7.8547 5.8647 4.6563 6.9721 6.1375 4.7123 6.9825 2.7059 3.8435 2.9239 6.1620 2.8421 4.9339 3.3996 6.3695 4.8817 1.3388 6.1652 2.9945 2.7110 3.6908 1.3943 1.6778 4.4407 1.4257 1.2646 4.9317 5.4762 4.1975 1.4850 1.4290 2.2969 5.6829 1.3552 6.2490 1.3041 1.4131 2.1174 3.4235 1.5556 1.6114 3.3312 1.0511 2.0136 1.1132 1.8341 2.0911 1.3591 1.3922 1.2748 2.4365 7.2115 1.4271 1.6173 4.9807 2.2182 2.2429 6.9066 5.3179 6.0197 8.4875 1.0592 1.0881 1.1064 1.0870 1.0936 1.0996 1.0953 1.0915 1.0996 1.1086 1.0760
irintensity: 0.4214 1.0483 1.2487 1.9255 3.6429 1.2784 2.3041 2.2091 4.5183 8.3420 5.1672 12.2846 0.0172 17.8474 27.0108 4.1968 5.1750 1.5905 3.8715 31.8328 8.8758 0.8862 68.6174 27.3637 88.3763 112.2549 74.4139 15.8632 0.4373 10.4720 12.8581 12.7075 0.6279 14.2005 42.0719 340.6344 0.1474 9.4588 2.3732 37.4341 3.2848 1.6602 27.4493 16.2469 360.4139 0.8702 3.6052 5.6070 21.8837 6.4428 12.7286 51.4560 8.9910 1.0791 52.1564 18.7048 141.7423 18.5291 13.9951 521.6846 3.0006 28.6934 101.7733 224.2371 24.3482 12.9854 1.9612 0.7431 31.3106 23.2571 5.9018 3.0885 0.1485 0.5780 32.3940
temp: 298.150 k
press: 1.00000 atm
elementType: 8 8 8 7 6 6 6 6 6 6 6 6 6 6 6 6 1 1 1 1 1 1 1 1 1 1 1
symmnumber: 1
zpe: 542637.3 jmol-1
zpe.correction: 0.206680 hartree
zpe.thermalcorrener: 0.220413 hartree
zpe.thermalcorrenthalpy: 0.221357 hartree
zpe.thermalcorrgfe: 0.163538 hartree
zpe.sumelectzpe: -743.146500 hartree
zpe.sumelectthermal: -743.132766 hartree
zpe.sumelectthermalent: -743.131822 hartree
zpe.sumelectthermalfe: -743.189641 hartree
dipole: 0.2383 -0.5587 1.2645
dipole: 1.4028
quadrupole: -79.7233 -86.5271 -91.5885
quadrupole: 3.5612 -0.7150 -1.0108
quadrupole: 6.2230 -0.5808 -5.6422 3.5612 -0.7150 -1.0108
hfenergy: -743.3531794 hartree
pointgroup: C01[X(C12H11N1O3)]
dipole: 0.110908 -0.54063 0.0005682 debye
polarizability: 203.507441|3.0546397|117.0541365|-15.124808|19.6928739|114.8385588 unknown
InChI: InChI=1S/C12H11NO3/c14-12(13-10-5-2-1-3-6-10)16-9-11-7-4-8-15-11/h1-8,13H,9H2
charge 0 multiplicity 1
27 atoms
O  1.035803 -0.050935 -1.631627
O  4.111819 -0.727079 -0.695761
O  0.119948 1.499739 -0.104703
N  -1.048681 -0.426967 -0.851205
C  2.321782 0.729708 -1.586963
C  3.192054 0.324897 -0.452919
C  -2.304515 -0.324235 -0.18931
C  3.310604 0.737871 0.866566
C  -3.246581 -1.36359 -0.415395
C  -2.637619 0.757205 0.668417
C  4.337605 -0.074063 1.482409
C  0.023274 0.444085 -0.780409
C  -4.50951 -1.322941 0.209111
C  -3.907089 0.78146 1.285262
C  4.797114 -0.945752 0.50809
C  -4.849356 -0.249078 1.064766
H  2.067004 1.799438 -1.51219
H  2.789942 0.500365 -2.555604
H  2.712773 1.518365 1.332488
H  -0.90159 -1.23826 -1.455937
H  -2.989901 -2.200529 -1.077402
H  -1.910716 1.553185 0.841836
H  4.687841 -0.017139 2.51093
H  -5.226874 -2.130619 0.026385
H  -4.159025 1.618506 1.946133
H  5.553013 -1.725764 0.485747
H  -5.830519 -0.217574 1.549881
