program: Gaussian 09
title: 000232367
version: EM64L-G09RevD.01
frameworkgroup: C1[X(C10H11Br2NO2)]
method: RPBEPBE
basis: SDD
operation: Freq
keyword: #p
keyword: freq=noraman
keyword: PBEPBE/SDD
title: #p freq=noraman PBEPBE/SDD
converged: NO YES NO NO
title: Mulliken charges:
elementType: Br Br O O N C C C C C C C C C C H H H H H H H H H H H
charge: -0.018045 0.008062 -0.309192 -0.265821 -0.461502 -0.346659 -0.238381 -0.672357 0.492641 -0.436813 -0.342195 0.259518 -0.150234 -0.160749 -0.238596 0.244427 0.244393 0.229288 0.229364 0.279414 0.279391 0.334020 0.232508 0.305727 0.251309 0.250482
chargesum: 0.00000
title: Mulliken charges with hydrogens summed into heavy atoms:
elementType: Br Br O O N C C C C C C C C C C
charge: -0.018045 0.008062 -0.309192 -0.265821 -0.127482 0.142160 0.220272 -0.113552 0.492641 -0.204305 -0.036469 0.259518 0.101075 0.089733 -0.238596
polarizability: 2.85862770e+02 6.00322487e+00 1.31727459e+02 -7.68534390e-03 -7.65628099e-03 6.78827789e+01
1716.lowfreq: -5.5635 -0.7076 -0.0003 0.0001 0.0003 2.1328 13.5952 30.6579 40.7595
frequency: 10.8130 30.6562 40.4539 62.1624 70.3262 91.7101 101.3740 124.5283 146.2763 170.2534 187.0002 230.7999 294.1831 321.0405 359.0101 371.0397 409.1555 429.5276 508.5915 612.2163 620.9058 643.2293 649.8205 699.3240 705.9850 713.3742 762.3709 815.9729 826.9672 835.0578 843.8710 912.8070 943.6274 979.1179 988.8176 1013.4983 1022.6385 1058.6417 1063.3916 1065.2702 1118.6244 1160.9174 1162.6262 1189.1220 1230.8959 1253.2729 1261.7636 1281.8014 1297.1629 1313.9061 1362.8842 1379.1144 1401.9537 1454.7072 1473.5672 1475.2016 1488.8617 1512.4242 1591.8045 1607.7238 1665.3937 3000.6694 3024.3767 3049.5041 3058.7548 3090.0279 3124.8649 3133.5021 3164.5652 3173.8371 3191.0856 3541.5416
redmass: 9.8349 12.3341 3.8585 3.3351 4.5815 11.7678 2.7416 3.5220 10.4067 4.9754 7.7023 9.2253 6.3831 5.6313 5.9515 4.7964 2.9798 6.4368 2.7310 6.5072 6.8784 1.3290 5.7989 4.8866 3.6058 9.0421 1.0802 1.3875 5.5549 1.2070 1.4153 8.7781 1.3580 1.3279 5.1739 8.0547 1.1911 4.8593 2.5511 2.8597 1.3469 3.3269 1.2596 1.1112 1.1808 1.2389 2.1009 1.0846 1.3317 1.3041 2.9233 1.8575 3.7862 1.0995 1.2816 1.7068 1.1133 2.2951 5.2241 6.1840 8.6352 1.0571 1.0597 1.0562 1.1067 1.1061 1.0905 1.1108 1.0907 1.0950 1.0957 1.0762
irintensity: 1.0271 0.5712 2.0527 0.1032 5.6670 1.1124 0.0234 0.4117 1.7858 6.8827 1.3202 0.2921 16.8131 0.0031 27.5924 3.0695 0.0049 9.7089 42.0118 44.6434 0.3807 40.1946 0.0213 43.0201 5.0973 13.0888 9.2827 44.2779 9.3127 0.6546 60.8990 29.4803 1.5564 2.2192 91.0986 203.6186 0.8122 22.2616 120.0991 42.5521 32.1180 489.8878 2.2831 16.7915 14.6179 0.8791 9.1825 0.0003 16.3566 22.2819 161.3249 2.2264 33.2345 3.1553 4.1870 49.3291 68.4455 669.6763 44.8562 52.1288 245.1845 19.3919 9.2015 24.2742 9.2449 18.9969 14.0391 18.7774 3.3703 3.4511 5.5819 33.4137
temp: 298.150 k
press: 1.00000 atm
elementType: 35 35 8 8 7 6 6 6 6 6 6 6 6 6 6 1 1 1 1 1 1 1 1 1 1 1
symmnumber: 1
zpe: 508247.0 jmol-1
zpe.correction: 0.193581 hartree
zpe.thermalcorrener: 0.209326 hartree
zpe.thermalcorrenthalpy: 0.210270 hartree
zpe.thermalcorrgfe: 0.145032 hartree
zpe.sumelectzpe: -618.686409 hartree
zpe.sumelectthermal: -618.670664 hartree
zpe.sumelectthermalent: -618.669720 hartree
zpe.sumelectthermalfe: -618.734958 hartree
dipole: -1.0610 -1.1528 -0.0002
dipole: 1.5667
quadrupole: -134.9879 -101.1198 -109.4053
quadrupole: -8.7801 -0.0015 -0.0041
quadrupole: -19.8169 14.0512 5.7657 -8.7801 -0.0015 -0.0041
hfenergy: -618.8799904 hartree
pointgroup: C01 [X(C10H11Br2N1O2)]
dipole: -0.3953655 0.4728896 -0.0011027 debye
dipolederiv: -0.5638644 0.0942404 -0.0005166 0.21635 -0.2126995 0.0003053 -0.0007844 0.0002577 -0.1357799 -0.8216902 0.059542 -0.0009347 0.0830232 -0.0746111 0.0001282 -0.0009076 0.0001375 -0.0376563 -2.4951134 0.0955693 -0.0024848 0.4539068 -0.4731909 0.0006831 -0.0036041 0.0004118 -0.3058526 -0.8463161 0.0114363 -0.0005785 -0.2359591 -0.948928 0.0008528 -0.0003321 0.0007389 -0.331851 -2.2629709 -0.2422083 -0.0017184 -0.6827875 -0.4472365 -0.0006203 -0.0008145 -0.0000616 -0.3304604 -0.2415837 0.0177493 -0.0002609 0.1524611 -0.0339025 0.0003195 -0.0003674 0.000256 0.1096279 1.1368361 0.0601894 0.0007582 0.2191433 0.2990821 0.0005039 0.0004948 0.0001815 0.3737657 0.7341006 -0.2564983 0.0010185 -0.2499162 0.2766297 -0.0004575 0.0010291 -0.0004932 0.1327646 1.6130204 0.0133774 0.0015678 -0.2972998 -0.0026368 -0.0001338 0.0018512 0.0002293 0.1087303 -0.2908958 -0.0005819 -0.0000971 -0.1319881 0.0435921 -0.000591 0.0003611 -0.0004886 -0.2041229 -0.2796153 -0.0103857 -0.0001354 0.1738262 -0.0398469 -0.0000648 -0.0002478 -0.0002509 -0.1626834 3.0622283 0.1093729 0.0027953 0.4634616 1.3976762 -0.0013008 0.0025895 -0.0014821 0.3131852 -0.2551619 0.0641805 -0.0003386 0.0783741 0.0669397 -0.000161 -0.0005359 -0.0001839 -0.0775957 -0.2750026 -0.0133438 -0.0001494 -0.0061949 0.0957501 -0.0003321 -0.0002806 -0.0003213 -0.0793019 1.281318 -0.1386388 0.0017762 -0.1574989 -0.0535775 -0.0003851 0.0018562 -0.0003394 -0.1494836 0.0876885 -0.0072079 0.0100005 -0.0158584 0.0122449 0.0869197 0.0117403 0.0928932 -0.0372549 0.0878261 -0.007248 -0.0098287 -0.0159509 0.0115857 -0.087125 -0.0117074 -0.0930243 -0.0365548 -0.043925 -0.005076 -0.008371 -0.0881018 -0.004531 0.0779451 0.0148798 0.0968865 -0.0577987 -0.0442392 -0.0047303 0.0084406 -0.087746 -0.0049466 -0.0782696 -0.014457 -0.0970676 -0.0574152 -0.0215047 0.0796619 -0.0210361 0.0312994 -0.0328033 0.0916931 0.0238499 0.0966272 -0.0155508 -0.021449 0.0799125 0.0206176 0.0312245 -0.0337936 -0.0915936 -0.0240348 -0.0964518 -0.0146021 0.2068276 -0.03808 -0.0000481 0.0118123 0.1573102 0.0003228 -0.0000398 0.0002642 0.3269507 -0.0005115 0.1051488 -0.0003703 0.0914732 -0.0504052 0.0005074 -0.0003619 0.0005228 0.1712512 0.1525581 -0.0447148 0.0000672 -0.0247243 0.0676411 0.0001977 0.0000487 0.0001633 0.1804258 0.0361984 -0.0763025 0.0000294 -0.0786361 0.0046573 0.000239 0.0000298 0.0002085 0.1610541 0.0652415 0.0546354 -0.0002027 0.0663065 -0.0199995 0.0004172 -0.000255 0.0003863 0.1562086 unknown
polarizability: 284.9425425|-13.3035294|132.6471918|0.2503781|-0.1302629|67.883273 unknown
InChI: InChI=1S/C10H11Br2NO2/c11-6-1-7-15-10(14)13-9-4-2-8(12)3-5-9/h2-5,13H,1,6-7H2
charge 0 multiplicity 1
26 atoms
Br -7.368462 0.827576 -0.011779
Br 6.350456 -0.199999 0.003878
O  -2.046503 0.315283 -0.006024
O  -0.707115 -1.624594 -0.001677
N  0.197234 0.572123 -0.004037
C  -4.458162 0.389573 -0.008851
C  -3.248612 -0.556804 -0.00652
C  -5.763686 -0.414206 -0.007572
C  1.598713 0.340916 -0.002228
C  2.45096 1.477033 -0.003476
C  2.165406 -0.960869 0.000812
C  -0.814138 -0.373665 -0.00336
C  3.851747 1.324145 -0.001687
C  3.568324 -1.112997 0.002597
C  4.399512 0.024691 0.00135
H  -4.414451 1.039321 -0.900609
H  -4.414919 1.042836 0.880367
H  -3.221895 -1.203464 0.890267
H  -3.21983 -1.205292 -0.901902
H  -5.887222 -1.029685 0.897237
H  -5.886172 -1.03444 -0.909274
H  -0.121903 1.543576 -0.005963
H  2.024237 2.487427 -0.005834
H  1.51441 -1.837328 0.001782
H  4.500618 2.204251 -0.002653
H  4.002853 -2.116604 0.004954
