program: Gaussian 09
title: 000232366
version: EM64L-G09RevD.01
frameworkgroup: C1[X(C10H11Cl2NO2)]
method: RPBEPBE
basis: SDD
operation: Freq
keyword: #p
keyword: freq=noraman
keyword: PBEPBE/SDD
title: #p freq=noraman PBEPBE/SDD
converged: NO YES NO NO
title: Mulliken charges:
elementType: Cl Cl O O N C C C C C C C C C C H H H H H H H H H H H
charge: -0.080596 -0.064046 -0.304956 -0.271388 -0.464685 -0.356368 -0.253191 -0.578776 0.510422 -0.436008 -0.369933 0.261467 -0.042172 -0.186285 -0.256825 0.242183 0.248428 0.226492 0.248673 0.264615 0.274872 0.337506 0.254274 0.303804 0.233744 0.258751
chargesum: 0.00000
title: Mulliken charges with hydrogens summed into heavy atoms:
elementType: Cl Cl O O N C C C C C C C C C C
charge: -0.080596 -0.064046 -0.304956 -0.271388 -0.127180 0.134243 0.221974 -0.039290 0.510422 -0.181734 -0.066129 0.261467 -0.042172 0.047459 0.001926
polarizability: 2.27168879e+02 -4.46255498e-01 1.36259330e+02 -1.23330038e+01 3.98209392e+00 7.17177314e+01
1716.lowfreq: -7.8909 -4.9649 -2.1144 -0.0007 0.0014 0.0021 21.0604 26.5874 31.8300
frequency: 20.7354 26.4844 31.7897 75.5174 88.1601 99.6892 110.8887 183.5711 205.4272 230.0158 245.9698 276.8750 290.6914 350.1338 363.6776 408.7931 438.4594 483.2081 560.2309 601.2232 623.5980 650.3759 654.1199 684.4806 695.0893 705.0945 786.6814 789.4185 845.1645 864.5108 866.4154 909.0028 910.5916 979.0402 988.3484 995.9205 1022.2035 1049.3124 1074.3837 1098.0105 1098.3628 1163.0860 1173.9444 1180.6200 1216.6425 1251.1183 1279.9348 1303.1475 1309.4896 1321.2973 1373.1268 1383.5450 1415.0513 1448.2049 1455.3941 1461.1762 1475.7934 1517.7948 1587.6142 1614.8772 1660.8317 2995.3038 3026.6816 3053.3270 3068.3452 3120.3379 3138.5897 3146.8767 3147.9777 3180.2545 3195.0489 3538.3058
redmass: 9.8329 5.3847 4.8260 8.7572 5.7023 8.3956 5.4591 5.4535 4.0981 2.6835 4.1506 5.1053 4.2790 4.6432 6.2521 8.6116 3.0556 4.5841 4.2904 4.6430 5.6871 1.6418 4.0318 2.3282 5.9068 4.4368 1.3793 1.3204 2.0949 1.5810 3.0218 1.4148 5.1100 5.9356 1.3139 2.2498 5.0526 1.6237 2.0234 1.6206 2.3639 3.3207 1.3781 1.0874 1.2503 1.7441 1.1639 1.1253 1.5078 1.2963 2.6906 1.9168 3.1310 1.0836 1.0987 1.0926 2.5804 2.3291 5.0725 6.4939 8.1427 1.0618 1.0625 1.0638 1.0911 1.1052 1.1109 1.0908 1.0907 1.0951 1.0958 1.0761
irintensity: 1.1239 1.0431 0.3813 9.6096 0.4463 1.3352 2.9424 0.6271 0.6870 1.9368 1.3120 10.0645 11.4637 22.7170 2.8203 5.9914 7.4560 2.0290 3.3573 27.7226 4.1623 32.2787 16.8872 30.5834 32.2559 54.4500 11.8029 56.0311 42.6807 52.0416 27.0490 3.5392 12.6341 12.1480 3.4773 48.6158 160.6610 64.1813 32.8956 22.6915 4.2936 492.0776 15.8959 2.1138 15.9019 12.3783 3.4125 21.8287 16.1477 6.5439 106.7388 10.8139 80.0229 1.4074 9.2940 31.3065 92.9112 437.4970 172.5148 170.3164 218.8097 5.8848 26.7748 13.6084 16.9891 8.4657 14.8154 11.0933 2.6687 2.1902 5.4432 34.4327
temp: 298.150 k
press: 1.00000 atm
elementType: 17 17 8 8 7 6 6 6 6 6 6 6 6 6 6 1 1 1 1 1 1 1 1 1 1 1
symmnumber: 1
zpe: 511914.4 jmol-1
zpe.correction: 0.194978 hartree
zpe.thermalcorrener: 0.210010 hartree
zpe.thermalcorrenthalpy: 0.210954 hartree
zpe.thermalcorrgfe: 0.149093 hartree
zpe.sumelectzpe: -1511.889457 hartree
zpe.sumelectthermal: -1511.874426 hartree
zpe.sumelectthermalent: -1511.873481 hartree
zpe.sumelectthermalfe: -1511.935342 hartree
dipole: 0.3807 0.6799 0.7566
dipole: 1.0861
quadrupole: -118.6327 -97.8532 -102.6529
quadrupole: 0.4959 3.5399 2.0729
quadrupole: -12.2531 8.5264 3.7267 0.4959 3.5399 2.0729
hfenergy: -1512.0844352 hartree
pointgroup: C01 [X(C10H11Cl2N1O2)]
dipole: -0.1471894 -0.0645592 0.3959418 debye
dipolederiv: -0.5296386 0.0603248 -0.1221447 0.1220466 -0.2260878 0.0720647 -0.2207443 0.0593503 -0.3217656 -0.602575 -0.2812492 0.1283633 -0.3574877 -0.3328122 0.1299934 0.1719269 0.1351206 -0.1463985 -2.0449256 0.2196214 -0.1205637 0.5269911 -0.4860897 0.1353117 -0.4631423 0.1310301 -0.4552649 -0.9074782 -0.0538408 0.011695 -0.2399256 -0.7285994 0.2150329 0.1529713 0.2479733 -0.4682827 -2.2856865 -0.0211175 -0.1208771 -0.2786022 -0.3452242 -0.015725 -0.0218032 0.0064154 -0.3321825 -0.3001498 0.0071718 -0.0219077 -0.0604887 0.0556289 -0.0153882 -0.063833 0.0200083 -0.0915809 1.0966806 -0.0757835 -0.0124078 0.1530212 0.2458348 0.0458365 -0.1590938 0.0217137 0.2675871 0.6666832 -0.1325746 0.2517308 -0.0855815 0.2535411 -0.1117079 0.3834639 -0.1322549 0.3784671 1.4586994 -0.1423623 0.2132788 -0.4248554 0.1691416 -0.0648352 0.4383123 -0.0492504 0.1870342 -0.6243971 -0.0253458 -0.0219907 -0.1975244 -0.13729 -0.051614 0.0798464 -0.0325993 -0.148775 -0.3173049 0.0182509 -0.0182759 0.2808258 -0.1580591 0.0102027 -0.2001613 -0.0136862 -0.1898128 3.0080252 -0.0057833 0.1518898 0.2328982 0.9975718 -0.3762821 0.106205 -0.4539595 0.5692921 0.9675975 0.3828809 -0.1424941 0.5544945 0.4958927 -0.2875389 -0.2436085 -0.30242 0.1377315 0.2490718 0.0746976 -0.0080029 -0.0501596 0.083543 -0.1402167 0.0766068 -0.1273499 -0.0334876 -0.3323254 -0.1389227 0.0774979 -0.1559977 -0.2735629 0.0623241 0.0795977 0.0638904 -0.1823691 0.0864392 -0.0212597 0.0229177 -0.0163603 -0.1079533 -0.0423014 0.0514057 -0.003291 0.0708931 0.0192627 0.0342636 -0.1031439 -0.0072176 0.0850757 0.0569026 -0.0547783 0.0351768 -0.0028276 -0.0040055 0.0152602 0.0124856 -0.0810001 -0.0907624 -0.0576033 0.0732571 -0.0005128 0.069759 -0.0109117 0.0191219 -0.0612003 0.0327477 0.0788763 0.066599 -0.0373551 0.0292764 -0.0158446 0.0198542 0.0327024 -0.0600677 -0.019719 -0.115709 0.0271136 -0.0896577 0.0038822 0.0473052 -0.0597716 0.0517456 0.0076351 0.0546545 0.0764082 -0.0262336 0.0337414 -0.0069654 -0.1061259 0.1911882 -0.0361847 0.0033087 -0.0110416 0.2159723 0.0689554 -0.0178766 0.0698951 0.2798856 0.0853899 0.0380219 -0.0373882 0.0387066 0.0318376 0.1005943 -0.0380139 0.1008038 0.1082788 0.13735 -0.0565879 0.0277435 -0.0562098 0.113332 0.0417165 0.0277776 0.0406118 0.1575947 0.0629556 0.0071758 -0.0144946 0.025629 -0.0200324 0.115995 -0.0274766 0.1150552 0.0752267 -0.0300277 0.0297733 -0.0435871 0.0201561 0.1195266 0.040804 -0.0375673 0.042086 0.1456628 unknown
polarizability: 227.3688165|5.5270806|113.8942751|9.5228837|-31.0412166|93.8828489 unknown
InChI: InChI=1S/C10H11Cl2NO2/c11-5-2-6-15-10(14)13-9-4-1-3-8(12)7-9/h1,3-4,7,13H,2,5-6H2
charge 0 multiplicity 1
26 atoms
Cl -6.572397 0.909602 -0.420918
Cl 5.304489 1.567275 -0.705103
O  -1.998902 0.640732 -0.954971
O  -1.203426 -1.158736 0.349261
N  0.222425 0.488018 -0.598474
C  -3.940861 0.626003 0.596084
C  -3.387373 0.150302 -0.755982
C  -5.374091 0.159623 0.847449
C  1.513484 0.076652 -0.175214
C  2.611384 0.88529 -0.576825
C  1.736667 -1.082934 0.614198
C  -0.992361 -0.118964 -0.325421
C  3.90604 0.516256 -0.180703
C  3.055324 -1.415054 0.989078
C  4.162245 -0.625764 0.60099
H  -3.884136 1.727569 0.657083
H  -3.312184 0.207154 1.407029
H  -3.390785 -0.95317 -0.81906
H  -3.94965 0.58301 -1.597218
H  -5.494328 -0.929993 0.74398
H  -5.752337 0.496108 1.823544
H  0.158518 1.328912 -1.177268
H  2.456258 1.783005 -1.184948
H  0.890194 -1.700542 0.919388
H  3.227346 -2.309537 1.5971
H  5.181853 -0.888417 0.894023
