program: Gaussian 09
title: 000232322
version: EM64L-G09RevD.01
frameworkgroup: C1[X(C10H21NO2)]
method: RPBEPBE
basis: SDD
operation: Freq
keyword: #p
keyword: freq=noraman
keyword: PBEPBE/SDD
title: #p freq=noraman PBEPBE/SDD
converged: YES YES NO NO
title: Mulliken charges:
elementType: O O N C C C C C C C C C C H H H H H H H H H H H H H H H H H H H H H
charge: -0.417564 -0.241606 -0.657847 -0.383221 -0.373566 0.216484 -0.382234 -0.376303 -0.353815 -0.732762 -0.356713 0.115293 -0.696995 0.194443 0.213924 0.234423 0.195195 0.188930 0.189395 0.189570 0.193135 0.186978 0.186989 0.215063 0.228015 0.239721 0.194746 0.195492 0.269946 0.310617 0.209421 0.209205 0.214614 0.381028
chargesum: 0.00000
title: Mulliken charges with hydrogens summed into heavy atoms:
elementType: O O N C C C C C C C C C C
charge: -0.036536 -0.241606 -0.077285 0.025146 0.056052 0.216484 -0.003910 0.006402 0.020152 -0.049963 0.033525 0.115293 -0.063754
polarizability: 1.41799198e+02 3.71150924e-01 1.14145861e+02 -1.28432643e+00 1.81527709e+00 1.11072408e+02
1716.lowfreq: -8.5148 -0.0005 0.0006 0.0007 3.0292 6.1191 30.7969 37.3031 39.6141
frequency: 29.7618 36.8011 39.5220 57.8054 78.8880 99.9638 119.1420 141.7706 160.3002 174.3839 196.4658 227.4673 235.2088 245.9862 257.6159 283.4456 358.4443 363.3717 398.9973 443.7129 487.6387 501.8851 535.7822 563.7407 600.5084 703.1751 721.1323 729.6294 733.5882 761.1925 822.2262 882.0085 888.4840 912.3234 943.1655 990.9204 999.9777 1006.5105 1035.2362 1046.0967 1059.8197 1070.7890 1081.0942 1084.8028 1118.5970 1126.0729 1188.3196 1212.1558 1223.2639 1238.5186 1251.3637 1265.1206 1276.4187 1283.8563 1292.6307 1296.3689 1309.8915 1337.3206 1346.0959 1354.7343 1355.3473 1380.4073 1389.1212 1446.6330 1461.5720 1462.0550 1466.0111 1468.5804 1475.8305 1476.8983 1477.2197 1483.3211 1487.9886 1600.8005 1656.7863 2947.4903 2950.1709 2956.4619 2961.3843 2967.8176 2970.8892 2975.4214 2979.5996 2983.6302 2993.7194 3012.6705 3026.7774 3035.9346 3054.0048 3067.4124 3069.6013 3076.3655 3097.5928 3480.5208 3519.5672 3622.3708
redmass: 2.8415 1.9643 5.8736 3.6693 3.4830 1.7168 2.7488 2.1323 2.1785 1.4992 2.6031 1.1337 3.0005 1.0921 2.8120 2.9744 2.7560 3.5756 3.0492 2.8346 2.6075 3.2416 1.5844 2.8679 1.3323 3.4882 1.0649 2.1102 1.5268 1.2118 1.2784 2.0067 1.8563 1.3309 2.0249 1.2680 2.7352 2.0545 2.6723 3.0323 2.4911 1.4903 2.1024 2.3167 2.1188 2.4871 1.7594 1.5699 1.6251 1.8731 1.4807 1.4012 1.2492 1.0802 1.1321 1.1827 1.3007 1.6511 1.7193 1.6995 1.5517 1.2762 1.2176 1.0873 1.0693 1.0728 1.0526 1.0741 1.0772 1.0422 1.0762 1.0848 1.0909 1.4234 3.1086 1.0587 1.0587 1.0600 1.0623 1.0578 1.0375 1.0565 1.0393 1.0958 1.0989 1.1014 1.0998 1.1034 1.1029 1.1007 1.0993 1.0998 1.1004 1.0452 1.0641 1.0993
irintensity: 0.3824 0.0053 1.8455 0.4229 0.2570 0.2489 0.1186 0.7603 2.8184 15.1390 3.4839 0.0015 0.3018 0.0859 4.4519 3.8911 3.3627 3.2694 1.2717 20.1872 25.2617 24.5296 146.2891 41.1490 152.2450 23.4871 13.4592 14.0160 14.0154 9.2719 0.8267 7.0571 4.4531 0.8865 0.8928 0.3070 0.7965 3.5268 107.6578 90.1190 8.1533 39.2570 0.5678 4.7843 5.6537 27.0607 1.2559 26.5522 1.1414 3.1336 3.3241 4.4277 2.7077 0.7262 0.0186 3.1221 0.9123 1.6497 7.6979 0.2974 2.5067 9.8901 10.9545 1.0614 0.0145 0.0412 7.9715 0.8243 2.7223 12.2227 9.7848 2.1971 24.1193 180.2236 122.2518 3.7305 1.7625 12.6802 20.2710 109.8752 32.1066 42.8204 53.7404 4.9852 2.7919 2.5857 10.0626 62.3559 73.7146 99.0109 55.3007 33.6659 26.3827 12.5029 27.8060 13.8737
temp: 298.150 k
press: 1.00000 atm
elementType: 8 8 7 6 6 6 6 6 6 6 6 6 6 1 1 1 1 1 1 1 1 1 1 1 1 1 1 1 1 1 1 1 1 1
symmnumber: 1
zpe: 783969.6 jmol-1
zpe.correction: 0.298598 hartree
zpe.thermalcorrener: 0.315601 hartree
zpe.thermalcorrenthalpy: 0.316545 hartree
zpe.thermalcorrgfe: 0.252486 hartree
zpe.sumelectzpe: -597.788112 hartree
zpe.sumelectthermal: -597.771109 hartree
zpe.sumelectthermalent: -597.770165 hartree
zpe.sumelectthermalfe: -597.834224 hartree
dipole: -0.8204 -0.9651 -1.3022
dipole: 1.8166
quadrupole: -80.4525 -77.2371 -83.6059
quadrupole: 4.2519 3.5202 -6.1848
quadrupole: -0.0207 3.1947 -3.1740 4.2519 3.5202 -6.1848
hfenergy: -598.0867098 hartree
pointgroup: C01 [X(C10H21N1O2)]
dipole: 0.318004 0.3635009 -0.5268298 debye
polarizability: 141.8013124|0.6133893|114.0199086|1.1624993|-1.91347|111.1962459 unknown
InChI: InChI=1S/C10H21NO2/c1-3-4-5-6-7-8-10(2,11)9(12)13/h12H,3-8,11H2,1-2H3
charge 0 multiplicity 1
34 atoms
O  2.84584 -1.401059 -1.257874
O  3.320441 -1.573113 1.00164
N  2.625839 1.027829 1.489722
C  1.233478 0.891126 -0.583131
C  0.075521 0.125105 0.084833
C  2.632115 0.629804 0.071544
C  -1.311559 0.577077 -0.423578
C  -2.478482 -0.192004 0.236197
C  -3.870901 0.270951 -0.248247
C  3.733407 1.378362 -0.748424
C  -5.036822 -0.496559 0.416104
C  2.960805 -0.869034 0.030445
C  -6.424734 -0.024129 -0.068598
H  1.048465 1.981553 -0.497802
H  1.287082 0.646707 -1.660993
H  0.146685 0.277398 1.179215
H  0.191427 -0.96352 -0.099835
H  -1.434538 1.663536 -0.228762
H  -1.366671 0.450764 -1.525622
H  -2.362762 -1.277611 0.034122
H  -2.4152 -0.07387 1.338194
H  -3.936058 0.151407 -1.350382
H  -3.987259 1.356776 -0.046939
H  3.527132 2.464672 -0.712554
H  4.734012 1.201135 -0.314695
H  3.7387 1.060414 -1.804897
H  -4.921774 -1.580851 0.212118
H  -4.968217 -0.379277 1.517047
H  2.853589 2.008431 1.66038
H  3.07688 0.362902 2.124009
H  -6.575565 1.050046 0.150129
H  -6.529821 -0.160539 -1.161732
H  -7.240291 -0.586895 0.422121
H  3.086436 -2.366432 -1.231252
