program: Gaussian 09
title: 000232299
version: EM64L-G09RevD.01
frameworkgroup: C1[X(C11H9ClN6O)]
method: RPBEPBE
basis: SDD
operation: Freq
keyword: #p
keyword: freq=noraman
keyword: PBEPBE/SDD
title: #p freq=noraman PBEPBE/SDD
converged: YES YES NO NO
title: Mulliken charges:
elementType: Cl O N N N N N N C C C C C C C C C C C H H H H H H H H H
charge: -0.031919 -0.223940 -0.132337 -0.277532 0.058009 -0.132095 -0.064263 -0.577500 -0.533854 0.228209 0.464582 -0.155957 -0.423734 -0.349092 0.042113 0.025654 -0.194209 -0.200032 -0.116285 0.276256 0.253743 0.358737 0.245662 0.260252 0.264278 0.265647 0.327685 0.341920
chargesum: 0.00000
title: Mulliken charges with hydrogens summed into heavy atoms:
elementType: Cl O N N N N N N C C C C C C C C C C C
charge: -0.031919 -0.223940 -0.132337 0.081205 0.058009 -0.132095 -0.064263 0.092106 -0.003854 0.228209 0.464582 -0.155957 -0.178072 -0.088840 0.042113 0.025654 0.070069 0.065615 -0.116285
polarizability: 2.74362204e+02 2.30073480e+01 1.54225421e+02 -1.83187638e+01 -4.39953824e-01 1.25201618e+02
1716.lowfreq: -7.5905 -3.9858 -0.0014 0.0014 0.0022 6.2421 16.5930 23.7368 29.4382
frequency: 16.5060 23.6208 29.4047 83.9384 101.0414 135.6744 157.9818 182.5535 230.1470 251.0072 288.4233 310.7199 323.8835 334.1752 364.5656 373.6578 391.2415 408.9923 459.9583 482.6451 489.7046 537.2542 566.8954 576.2076 610.9203 624.1143 640.2345 661.9317 667.5671 689.5365 717.1841 732.2679 788.2150 796.1690 810.7728 833.7777 838.3109 941.8649 950.3974 967.6915 975.0905 989.8818 1001.7851 1015.1483 1073.8678 1109.7037 1113.1255 1139.1351 1186.8303 1189.4397 1211.7255 1236.9563 1264.0067 1300.9613 1340.4581 1348.3778 1362.6309 1383.7331 1399.2000 1405.2929 1444.7668 1466.7635 1480.9143 1495.3242 1565.1144 1587.4153 1598.5559 1603.4565 1623.0188 2989.5754 3044.6373 3132.1353 3139.0308 3173.4392 3176.1152 3550.7250 3570.5547 3713.2492
redmass: 7.3077 4.6405 8.1412 7.9560 8.1227 7.7378 6.6567 7.9457 6.6052 5.3296 5.9637 9.0423 7.6496 3.3804 2.7496 1.4872 8.2431 2.9322 8.8392 3.3645 1.1915 7.0327 3.0345 1.1921 6.9494 6.8677 5.7414 5.1369 8.0256 5.2890 11.1262 4.1156 11.9365 4.1134 6.2414 1.6365 1.2611 1.5330 8.4766 1.6093 1.4107 3.2547 4.1559 4.1436 2.8568 2.7289 1.5943 3.1677 1.2795 2.6808 3.0690 3.8747 1.6095 1.3060 2.6733 1.7293 4.1647 4.7483 3.9846 2.7350 3.3164 1.2172 2.1205 3.3071 4.7869 6.9344 2.5880 6.1025 4.0948 1.0591 1.1034 1.0904 1.0904 1.0951 1.0962 1.0441 1.0827 1.1061
irintensity: 1.9717 0.8886 3.7327 1.9723 3.0059 5.8161 0.1847 2.1493 0.0843 5.2981 3.6227 31.8407 8.2192 4.9581 1.1272 240.1875 16.1272 0.1825 0.2417 24.8312 241.8473 1.2628 68.6667 18.2264 13.1449 2.2056 6.1500 5.2926 6.2740 9.5691 15.3419 10.4323 10.1753 17.4816 9.0973 53.3137 3.3197 9.2648 7.2793 6.5485 0.9421 31.4184 51.5376 41.0325 51.4564 43.4819 28.3002 39.5236 18.0260 31.7195 1.6565 194.8085 18.4306 3.3513 29.2435 30.3652 306.5381 13.7759 50.9254 63.9234 89.6999 32.6077 53.1418 274.4986 251.1772 32.6065 865.5365 14.7388 25.3247 24.1204 5.8543 7.7486 5.4609 2.8317 0.1746 164.7871 145.8023 49.4648
temp: 298.150 k
press: 1.00000 atm
elementType: 17 8 7 7 7 7 7 7 6 6 6 6 6 6 6 6 6 6 6 1 1 1 1 1 1 1 1 1
symmnumber: 1
zpe: 519139.2 jmol-1
zpe.correction: 0.197730 hartree
zpe.thermalcorrener: 0.213763 hartree
zpe.thermalcorrenthalpy: 0.214707 hartree
zpe.thermalcorrgfe: 0.151404 hartree
zpe.sumelectzpe: -1286.980629 hartree
zpe.sumelectthermal: -1286.964596 hartree
zpe.sumelectthermalent: -1286.963652 hartree
zpe.sumelectthermalfe: -1287.026955 hartree
dipole: -7.6574 5.0097 3.3299
dipole: 9.7377
quadrupole: -155.6976 -118.6071 -108.1580
quadrupole: 29.9294 0.5302 -5.0217
quadrupole: -28.2101 8.8805 19.3296 29.9294 0.5302 -5.0217
hfenergy: -1287.1783586 hartree
pointgroup: C01 [X(C11H9Cl1N6O1)]
dipole: 3.1579655 0.5110094 -2.1079309 debye
polarizability: 269.8821741|-36.6854551|147.3110869|5.9728861|-15.9273267|136.5959823 unknown
InChI: InChI=1S/C11H9ClN6O/c12-7-3-1-6(2-4-7)5-18-9-8(16-17-18)10(19)15-11(13)14-9/h1-4,17H,5,13H2
charge 0 multiplicity 1
28 atoms
Cl 6.325275 0.172634 1.277804
O  -4.436078 -0.842682 1.788491
N  -0.311072 -0.473082 -0.415114
N  -0.374933 -1.612508 0.423732
N  -1.552687 -1.673114 1.114888
N  -1.982093 1.194944 -1.021749
N  -4.131087 0.891546 0.219303
N  -3.820832 2.599792 -1.331515
C  0.778483 -0.216995 -1.36836
C  -1.557763 0.131978 -0.338076
C  2.144447 -0.135641 -0.697537
C  -2.303336 -0.645503 0.640025
C  3.229569 -0.898485 -1.192559
C  2.353828 0.725486 0.410673
C  -3.708033 -0.235128 0.951073
C  -3.318523 1.509764 -0.665529
C  4.509692 -0.807823 -0.599662
C  3.623311 0.823182 1.018066
C  4.685081 0.052773 0.500399
H  0.493632 0.741266 -1.844233
H  0.775271 -0.995073 -2.155387
H  0.479913 -2.037657 0.787974
H  3.084822 -1.567844 -2.048975
H  1.523866 1.325667 0.80119
H  5.348217 -1.395409 -0.983491
H  3.786464 1.486686 1.871927
H  -3.240675 3.087985 -2.008639
H  -4.774459 2.890743 -1.130318
