program: Gaussian 09
title: 000232293
version: EM64L-G09RevD.01
frameworkgroup: C1[X(C11H9ClN6O)]
method: RPBEPBE
basis: SDD
operation: Freq
keyword: #p
keyword: freq=noraman
keyword: PBEPBE/SDD
title: #p freq=noraman PBEPBE/SDD
converged: NO YES NO NO
title: Mulliken charges:
elementType: Cl O N N N N N N C C C C C C C C C C C H H H H H H H H H
charge: -0.068683 -0.229731 -0.081809 -0.288087 0.063803 -0.145006 -0.068208 -0.581035 -0.612599 0.224863 0.581900 -0.148148 -0.286641 -0.357882 0.041937 0.023426 -0.218652 -0.226988 -0.213400 0.282209 0.269203 0.360159 0.262200 0.264954 0.243773 0.246345 0.322325 0.339773
chargesum: 0.00000
title: Mulliken charges with hydrogens summed into heavy atoms:
elementType: Cl O N N N N N N C C C C C C C C C C C
charge: -0.068683 -0.229731 -0.081809 0.072072 0.063803 -0.145006 -0.068208 0.081062 -0.061187 0.224863 0.581900 -0.148148 -0.286641 -0.095682 0.041937 0.023426 0.046302 0.016785 0.032945
polarizability: 2.28834298e+02 1.81443790e+01 1.97903089e+02 -2.99624425e+00 -6.91289646e+00 1.07897904e+02
1716.lowfreq: -8.7520 0.0002 0.0009 0.0024 1.7614 5.3531 20.2046 24.2209 53.1970
frequency: 19.8588 24.0223 53.1645 90.3915 117.0763 122.3774 152.6402 184.2120 224.7176 257.6819 267.0008 306.2069 322.5738 345.4354 364.8178 376.7142 414.1330 435.5587 462.1471 471.4579 484.4674 521.7019 566.2372 573.5350 597.7632 629.2525 642.3691 658.2545 670.0612 685.1836 717.6855 743.5100 770.3829 785.7625 807.2325 816.4161 877.2411 924.6220 950.9113 958.6753 990.8620 996.5053 1009.6353 1026.9022 1036.3376 1097.4184 1132.4479 1148.8590 1177.5129 1187.7244 1209.0678 1240.3657 1272.0974 1303.0704 1340.0099 1352.1763 1362.8581 1378.6761 1395.0918 1428.9192 1443.2947 1454.9031 1468.5787 1495.6939 1565.5486 1575.5227 1595.7624 1607.6913 1620.1002 3022.6225 3085.7680 3138.7061 3151.3898 3168.2572 3181.5231 3535.2316 3553.0900 3715.8351
redmass: 6.7653 7.6654 7.5041 8.2183 6.4336 9.0845 6.3133 8.1216 6.8860 7.0132 4.6325 5.2081 5.8094 4.2308 2.8186 2.1804 3.6249 3.4455 8.2152 1.1999 4.5971 5.8708 1.0966 4.2805 4.1376 4.6543 5.3301 5.9539 7.3387 5.7725 11.1067 2.7391 1.5850 11.7320 6.7404 4.1889 1.4552 2.0178 8.5633 1.4118 3.1463 1.3531 6.8098 4.6896 2.1670 2.4913 1.9958 2.6487 1.0715 3.6842 2.5785 6.0166 1.6705 1.4635 3.3429 1.5203 3.1482 5.6535 5.2647 2.1378 1.7281 1.9846 1.9136 3.0835 4.8189 6.0025 2.5838 7.2494 3.8362 1.0594 1.1044 1.0887 1.0899 1.0950 1.0999 1.0857 1.0443 1.1060
irintensity: 0.1388 3.8745 2.0598 3.3167 1.8874 1.6416 0.5489 1.4869 1.3262 10.3584 15.9733 22.2046 2.4849 9.5896 3.1455 47.9874 2.8550 6.6911 2.1223 242.8537 3.5922 2.7073 48.9322 3.8938 22.7656 30.0382 9.4517 6.7228 16.7359 16.2522 14.9078 40.7484 49.5628 9.2610 0.9226 11.1701 1.7612 9.8150 9.0870 1.5177 27.8650 0.5622 63.1465 27.5782 4.3089 58.2701 34.1032 40.1973 0.6524 54.4554 6.8476 188.2502 8.3485 14.8836 60.4443 19.2436 195.8404 1.3665 197.6109 25.6046 83.9082 60.4886 11.0652 235.4272 252.8656 9.6009 828.7448 4.8160 22.1440 15.3251 1.3636 0.8405 4.4715 6.8457 7.9165 426.8897 102.5756 46.4699
temp: 298.150 k
press: 1.00000 atm
elementType: 17 8 7 7 7 7 7 7 6 6 6 6 6 6 6 6 6 6 6 1 1 1 1 1 1 1 1 1
symmnumber: 1
zpe: 519535.2 jmol-1
zpe.correction: 0.197881 hartree
zpe.thermalcorrener: 0.213846 hartree
zpe.thermalcorrenthalpy: 0.214790 hartree
zpe.thermalcorrgfe: 0.152493 hartree
zpe.sumelectzpe: -1286.983321 hartree
zpe.sumelectthermal: -1286.967356 hartree
zpe.sumelectthermalent: -1286.966411 hartree
zpe.sumelectthermalfe: -1287.028708 hartree
dipole: -10.0698 5.2560 -3.3779
dipole: 11.8506
quadrupole: -135.6384 -106.9984 -117.0166
quadrupole: 17.7569 -20.5371 6.3400
quadrupole: -15.7540 12.8861 2.8679 17.7569 -20.5371 6.3400
hfenergy: -1287.1812015 hartree
pointgroup: C01 [X(C11H9Cl1N6O1)]
dipole: 4.2077794 -1.4566966 -1.3821427 debye
polarizability: 223.2506768|21.6544815|202.9808395|2.4000206|10.0468099|108.4037748 unknown
InChI: InChI=1S/C11H9ClN6O/c12-7-4-2-1-3-6(7)5-18-9-8(16-17-18)10(19)15-11(13)14-9/h1-4,17H,5,13H2
charge 0 multiplicity 1
28 atoms
Cl 3.041215 2.500245 -0.594688
O  -4.24307 1.186088 1.363259
N  -0.109039 0.656148 -0.783459
N  -0.250136 1.927103 -0.190905
N  -1.43636 2.074613 0.449329
N  -1.600153 -1.270192 -0.888901
N  -3.77291 -0.852182 0.272187
N  -3.304982 -2.865504 -0.799055
C  1.086887 0.180398 -1.497175
C  -1.287009 -0.027013 -0.512663
C  2.22856 -0.203207 -0.564582
C  -2.099745 0.898931 0.253236
C  3.17844 0.729284 -0.088426
C  2.365407 -1.545526 -0.124064
C  -3.457437 0.457373 0.6896
C  -2.903968 -1.600062 -0.44257
C  4.233519 0.381486 0.772642
C  3.411779 -1.926839 0.742615
C  4.347592 -0.965376 1.187916
H  1.399488 0.953478 -2.220551
H  0.736682 -0.705171 -2.055472
H  0.530978 2.585037 -0.131255
H  1.630262 -2.284105 -0.463488
H  4.945017 1.138594 1.113204
H  3.496585 -2.967716 1.069834
H  5.163049 -1.252855 1.859287
H  -2.686292 -3.454274 -1.349832
H  -4.231755 -3.174056 -0.51622
