program: Gaussian 09
title: 000232283
version: EM64L-G09RevD.01
frameworkgroup: C1[X(C10H7ClN6O)]
method: RPBEPBE
basis: SDD
operation: Freq
keyword: #p
keyword: freq=noraman
keyword: PBEPBE/SDD
title: #p freq=noraman PBEPBE/SDD
converged: YES YES NO NO
title: Mulliken charges:
elementType: Cl O N N N N N N C C C C C C C C C C H H H H H H H
charge: -0.031267 -0.214738 -0.219001 -0.291714 0.062936 -0.148312 -0.058203 -0.573763 0.203817 0.439046 -0.144687 -0.326172 -0.377319 0.043862 -0.198122 -0.180980 0.029917 -0.126342 0.348839 0.314288 0.245896 0.263078 0.264530 0.345521 0.328889
chargesum: 0.00000
title: Mulliken charges with hydrogens summed into heavy atoms:
elementType: Cl O N N N N N N C C C C C C C C C C
charge: -0.031267 -0.214738 -0.219001 0.057125 0.062936 -0.148312 -0.058203 0.100647 0.203817 0.439046 -0.144687 -0.011884 -0.131423 0.043862 0.064956 0.083550 0.029917 -0.126342
polarizability: 3.05571116e+02 -6.12579742e+00 1.90716831e+02 -6.82001671e-01 3.81438484e+00 6.41334289e+01
1716.lowfreq: -7.7123 -1.7166 -0.0024 -0.0021 -0.0019 5.6758 36.5588 38.5041 70.5707
frequency: 36.5574 38.4448 70.5701 101.0691 131.7076 179.2169 208.2988 232.0870 237.2513 298.1855 313.8641 326.5983 357.8595 394.8946 407.9135 415.9450 452.9045 482.5414 496.6362 500.0708 559.7063 563.3391 577.6439 619.8069 645.1086 654.3910 664.4011 702.1147 715.0811 716.4592 786.9368 801.8696 810.9608 836.8040 923.6159 941.2927 954.1537 973.0445 993.7753 998.5473 1045.8093 1077.6209 1112.1062 1135.9185 1155.6422 1193.6465 1201.7558 1277.2042 1302.6096 1344.1839 1357.5041 1372.2314 1404.7897 1414.8068 1448.0105 1485.9218 1497.1554 1561.8697 1580.4862 1594.7299 1603.1394 1620.2941 3149.4040 3164.9929 3176.3658 3181.0560 3548.4145 3552.2281 3710.1858
redmass: 8.5232 4.5754 8.6611 9.1132 8.2518 7.7211 8.8600 9.6851 10.7041 6.2794 6.1939 4.5116 7.1702 3.3607 2.8097 2.0206 8.9318 5.2067 1.3690 2.4052 4.7015 7.2440 1.1400 7.2217 6.4330 6.5288 8.5335 3.8163 7.6043 10.7950 11.9080 8.8348 1.3706 1.3938 8.6172 1.3607 8.0424 1.3442 3.1774 3.5150 5.6234 2.6072 1.8968 2.8711 3.4717 1.1414 5.0349 4.7750 1.3226 2.3912 3.5218 7.2416 3.4989 3.2971 4.6136 2.8541 3.4105 5.2533 5.5260 3.7087 5.9909 3.0270 1.0895 1.0900 1.0963 1.0979 1.0453 1.0810 1.1060
irintensity: 4.3922 2.6420 4.1688 2.3423 3.0216 2.7540 0.8875 0.7251 0.1538 1.0923 2.7275 1.5046 5.3197 94.4098 28.0116 199.1885 10.6572 34.2899 127.7635 123.3197 25.5403 12.0864 47.9039 5.7896 3.5017 25.1373 11.5013 0.7589 4.0931 13.8822 10.5351 1.0901 31.7180 56.9582 11.5947 0.6220 10.8476 2.0645 36.8308 73.3042 68.2146 43.0039 15.1748 17.6686 30.3818 0.5653 16.2636 178.2422 5.1154 107.3647 485.2633 3.3965 34.4721 35.0169 81.6582 88.2437 445.2045 245.9217 167.9134 622.7431 29.5062 14.6714 5.7447 3.5072 1.3561 6.0508 194.5240 58.4681 49.9314
temp: 298.150 k
press: 1.00000 atm
elementType: 17 8 7 7 7 7 7 7 6 6 6 6 6 6 6 6 6 6 1 1 1 1 1 1 1
symmnumber: 1
zpe: 444961.5 jmol-1
zpe.correction: 0.169477 hartree
zpe.thermalcorrener: 0.184040 hartree
zpe.thermalcorrenthalpy: 0.184984 hartree
zpe.thermalcorrgfe: 0.126741 hartree
zpe.sumelectzpe: -1247.757102 hartree
zpe.sumelectthermal: -1247.742539 hartree
zpe.sumelectthermalent: -1247.741595 hartree
zpe.sumelectthermalfe: -1247.799838 hartree
dipole: 7.7987 1.3549 0.7175
dipole: 7.9480
quadrupole: -158.9258 -88.4017 -111.3928
quadrupole: -21.7344 -0.6618 -0.7955
quadrupole: -39.3524 31.1718 8.1806 -21.7344 -0.6618 -0.7955
hfenergy: -1247.926579 hartree
pointgroup: C01 [X(C10H7Cl1N6O1)]
dipole: 3.0504451 0.6477553 0.2307807 debye
dipolederiv: -0.981209 -0.1625407 0.0281196 -0.244442 -0.1471438 -0.0045784 0.0361218 -0.0015908 -0.054663 -1.0495011 -0.384322 0.026249 -0.4559281 -0.7635109 0.0331178 0.024318 0.0309801 -0.3662332 -1.3741818 0.2767599 -0.0527418 -0.4273063 -0.0605163 0.0232404 -0.196549 0.0810476 -0.0528068 -0.6086542 0.8228348 0.0487921 0.9692541 -0.2277511 -0.0578832 0.4676708 -0.3624091 -0.1065796 0.3721413 -0.6644912 -0.0218678 -0.5867276 0.0696119 0.0193888 -0.0213631 0.0870183 -0.1390427 -1.3856136 0.4152952 -0.0570473 1.159513 -1.0243947 0.0933019 -0.2240824 0.1076018 -0.2555735 -0.9806081 -0.3429149 0.018909 -0.5949957 -1.3628926 0.0939399 0.0343973 0.0920043 -0.3152585 -0.415679 0.2259554 -0.0074756 0.3919895 -1.5597401 0.0883447 -0.0329047 0.0865845 -0.6798996 0.3269181 -0.0997346 0.0420602 -1.3477948 1.0315111 -0.0961788 0.0746149 -0.0823522 0.1962445 1.2481248 -0.0626677 -0.0392824 0.3581663 -0.0291449 0.0207989 -0.0429661 -0.0086021 0.081705 -0.0932875 -0.1572072 0.0186363 0.7047951 -0.4988866 0.0374123 -0.061637 0.0881135 0.0897217 -0.1850496 0.002122 -0.0075691 -0.0950532 -0.0107705 0.0198004 0.0355024 -0.0030185 -0.1265944 -0.0837406 0.0221748 -0.0052378 0.0574275 -0.0342914 0.0477571 0.0044011 0.0726884 -0.1557917 1.3957641 0.2446072 -0.0023227 0.5298164 1.4542937 -0.1159608 -0.0308685 -0.1295698 0.2188188 -0.2835509 -0.0287399 0.0066257 0.035047 0.0751891 0.0332036 0.0296539 0.025914 -0.0813991 -0.2952644 -0.0962447 -0.0087325 -0.2953515 -0.0094942 0.0291767 -0.0451862 0.0291691 -0.0783741 2.1499571 -0.1684127 0.0535043 -0.314099 1.9391298 -0.1797721 0.158485 -0.1845971 0.2097892 1.3003274 0.2871387 -0.0523373 0.4340699 0.1322437 0.0095451 -0.0272887 0.0087849 -0.0667939 0.2316612 -0.0388443 -0.0297722 -0.1093482 0.3767246 -0.0022374 -0.2114876 0.1263091 0.2883442 0.1637183 0.0470065 0.0303117 0.0251056 0.0790575 -0.018053 0.0411 -0.0021437 0.1644521 0.0884343 -0.0927311 -0.0016787 -0.076505 -0.0200585 -0.0395319 -0.0220406 -0.0332411 0.1603712 0.0685575 -0.0296381 -0.001337 -0.0464571 -0.0039572 -0.0294438 -0.0092814 -0.0243452 0.1557678 0.0189971 0.0577794 0.024603 0.0560945 0.0492089 -0.029316 0.0217546 -0.0289462 0.1559506 0.2355006 -0.1197554 0.0035063 -0.0564458 0.2593654 0.0132281 -0.0002897 0.0107762 0.3858165 0.136238 0.0465703 -0.0139152 -0.0708248 0.2862173 0.0106994 -0.0020746 0.013824 0.3720285 unknown
polarizability: 305.8316012|-2.3541107|190.5036829|-2.2766062|-2.4181745|64.0860918 unknown
InChI: InChI=1S/C10H7ClN6O/c11-5-1-3-6(4-2-5)17-8-7(15-16-17)9(18)14-10(12)13-8/h1-4,16H,12H2
charge 0 multiplicity 1
25 atoms
Cl 5.931973 0.870993 -0.090034
O  -4.552582 -1.239291 0.09583
N  0.117896 -0.740179 0.194465
N  -0.299345 -2.103495 0.2367
N  -1.664391 -2.217108 0.28755
N  -1.180419 1.334246 -0.018199
N  -3.647821 0.929057 -0.08852
N  -2.729951 3.060375 -0.264031
C  -1.05631 0.012958 0.103474
C  1.487998 -0.368083 0.100785
C  -2.141112 -0.958602 0.155421
C  1.848587 0.987053 0.318175
C  2.47763 -1.339678 -0.198357
C  -3.552138 -0.468042 0.055932
C  3.204979 1.360882 0.255153
C  3.834685 -0.961637 -0.250735
C  -2.548764 1.708585 -0.12056
C  4.182906 0.383675 -0.018738
H  0.28392 -2.789855 0.721333
H  1.067666 1.726812 0.511346
H  2.207446 -2.373873 -0.434658
H  3.494797 2.402144 0.420705
H  4.604853 -1.701697 -0.48477
H  -3.680927 3.413932 -0.340598
H  -1.923178 3.67763 -0.307269
