program: Gaussian 09
title: 000232289
version: EM64L-G09RevD.01
frameworkgroup: C1[X(C10H9Cl2N5O)]
method: RPBEPBE
basis: SDD
operation: Freq
keyword: #p
keyword: freq=noraman
keyword: PBEPBE/SDD
title: #p freq=noraman PBEPBE/SDD
converged: YES YES NO NO
title: Mulliken charges:
elementType: Cl Cl O N N N N N C C C C C C C C C C H H H H H H H H H
charge: -0.015232 -0.014495 -0.277616 -0.508328 -0.394846 -0.035596 -0.648028 -0.624604 0.174651 0.495924 0.134850 -0.321491 -0.452659 0.149539 -0.021710 -0.052352 -0.167104 -0.144861 0.308906 0.314467 0.286437 0.234833 0.256903 0.307349 0.347550 0.311536 0.355979
chargesum: 0.00000
title: Mulliken charges with hydrogens summed into heavy atoms:
elementType: Cl Cl O N N N N N C C C C C C C C C C
charge: -0.015232 -0.014495 -0.277616 -0.199423 -0.080379 -0.035596 0.006871 0.042911 0.174651 0.495924 0.134850 -0.035054 -0.217827 0.149539 -0.021710 -0.052352 0.089800 -0.144861
polarizability: 2.31461701e+02 -2.86898737e+00 1.56110316e+02 -1.54506063e+01 -1.13998524e+00 1.34481575e+02
1716.lowfreq: -0.0021 -0.0005 0.0008 1.6660 4.4858 6.2999 11.5945 29.1128 39.4808
frequency: 11.2400 29.0778 39.4773 93.5700 97.0198 155.2255 171.3533 183.3188 189.2227 207.9370 235.8648 263.1018 300.5961 322.2454 340.3800 349.9672 369.4493 379.6449 404.5584 434.7969 437.3675 454.0045 476.3092 500.1841 516.3479 547.5609 560.2838 573.8366 613.0117 618.4669 640.5244 677.9630 686.3178 689.0914 705.1023 763.3985 783.8345 802.9083 867.8468 879.4167 930.8576 933.4397 992.4989 998.6085 1049.3544 1116.9845 1142.4994 1193.0225 1209.6212 1241.7660 1255.5260 1289.0165 1322.5802 1347.3285 1398.7126 1403.9409 1450.6531 1469.2745 1484.8994 1527.5152 1575.1780 1576.8573 1593.6296 1611.9955 1626.5878 1685.1884 3132.7507 3166.2239 3169.9384 3492.5041 3511.7641 3540.0776 3555.3274 3677.6546 3707.1491
redmass: 6.8605 9.9018 10.2439 6.0458 6.4742 5.2932 5.6336 22.9955 6.3635 7.6640 1.2368 5.1848 3.8277 2.6072 5.2654 2.1478 3.8299 3.9812 5.9882 5.9297 2.4964 1.5470 5.7430 1.1480 7.3822 1.1754 8.9254 4.6224 1.7645 1.6199 7.1313 7.3841 4.8431 4.9094 7.3559 11.0539 6.5741 1.4161 1.4968 6.0665 2.1444 1.3764 4.8495 4.1059 1.8079 2.0843 1.4456 2.4948 3.6083 1.4226 4.1694 2.3022 2.1005 4.1636 5.3301 3.6277 1.7777 3.4066 4.7413 2.7198 1.9737 5.7557 1.8757 4.7487 1.9454 9.2308 1.0897 1.0919 1.0953 1.0478 1.0756 1.0767 1.0464 1.1002 1.1053
irintensity: 5.4762 0.9613 1.7410 5.1064 3.3888 1.0182 2.7257 0.0519 1.9849 0.6185 79.3486 0.7031 7.2692 8.3440 2.5070 23.2581 18.6341 37.4957 8.2019 26.6235 36.1131 114.3251 14.9068 286.3649 19.0495 25.8928 12.5215 8.3527 92.0347 65.8881 13.4626 17.8114 0.4718 2.5544 3.1988 1.3287 19.8253 47.4080 19.9052 23.2717 2.1997 0.1336 24.3174 5.3185 42.2210 44.5056 10.6462 5.8591 51.4979 4.7261 29.7609 61.8374 10.8226 61.0393 20.4435 62.4612 10.1121 499.4353 99.3445 765.3112 93.3522 18.8485 58.4184 162.7487 412.8424 79.7101 10.8193 0.6476 3.4806 97.7129 44.0887 40.8265 105.2735 40.4385 43.4342
temp: 298.150 k
press: 1.00000 atm
elementType: 17 17 8 7 7 7 7 7 6 6 6 6 6 6 6 6 6 6 1 1 1 1 1 1 1 1 1
symmnumber: 1
zpe: 494971.4 jmol-1
zpe.correction: 0.188525 hartree
zpe.thermalcorrener: 0.205662 hartree
zpe.thermalcorrenthalpy: 0.206607 hartree
zpe.thermalcorrgfe: 0.141533 hartree
zpe.sumelectzpe: -1654.295386 hartree
zpe.sumelectthermal: -1654.278248 hartree
zpe.sumelectthermalent: -1654.277304 hartree
zpe.sumelectthermalfe: -1654.342377 hartree
dipole: 2.0497 -1.8307 -6.7459
dipole: 7.2842
quadrupole: -160.0859 -99.8542 -111.2081
quadrupole: -9.9786 17.0118 -6.8373
quadrupole: -36.3698 23.8619 12.5080 -9.9786 17.0118 -6.8373
hfenergy: -1654.4839102 hartree
pointgroup: C01 [X(C10H9Cl2N5O1)]
dipole: -1.095502 -0.2465504 2.6366855 debye
polarizability: 233.4333948|4.9451247|156.0132754|-4.3633097|-3.4550311|132.6069223 unknown
InChI: InChI=1S/C10H9Cl2N5O/c11-5-2-1-4(3-6(5)12)15-8-7(13)9(18)17-10(14)16-8/h1-3,15-16H,13-14H2
charge 0 multiplicity 1
27 atoms
Cl -3.052486 1.573298 -2.220154
Cl -5.574426 -0.130172 -0.946285
O  4.240466 -0.471131 -1.532061
N  0.099019 -1.13282 0.954368
N  1.459389 0.860027 1.134694
N  3.496615 1.21864 -0.072844
N  2.117671 -2.061088 -1.076743
N  2.709641 2.8615 1.392594
C  1.244083 -0.414713 0.528335
C  -1.215144 -0.889211 0.492909
C  2.171922 -0.867405 -0.39352
C  -1.467703 0.085915 -0.508964
C  -2.305523 -1.624627 1.03637
C  2.56203 1.622805 0.795301
C  3.384056 -0.022872 -0.701148
C  -2.786564 0.315682 -0.942364
C  -3.616622 -1.386548 0.584872
C  -3.868691 -0.412247 -0.404686
H  0.226043 -1.906144 1.611255
H  0.77743 1.163262 1.832394
H  -0.642522 0.646987 -0.956266
H  -2.129412 -2.380397 1.810418
H  -4.454755 -1.953285 1.000758
H  1.311021 -2.676816 -1.039664
H  2.890115 -2.224212 -1.727233
H  2.007947 3.285958 1.992356
H  3.534501 3.391313 1.121108
