program: Gaussian 09
title: 000232275
version: EM64L-G09RevD.01
frameworkgroup: C1[X(C11H14N2)]
method: RPBEPBE
basis: SDD
operation: Freq
keyword: #pfreq=noraman
keyword: PBEPBE/SDD
title: #p freq=noraman PBEPBE/SDD
converged: YES YES NO NO
title: Mulliken charges:
elementType: N N C C C C C C C C C C C H H H H H H H H H H H H H H
charge: -0.463532 -0.059103 -0.491099 0.166332 0.311359 -0.015862 -0.354038 -0.578889 0.489646 -0.348641 -0.361065 -0.682517 -0.820061 0.244653 0.205001 0.187862 0.230915 0.302675 0.234847 0.245210 0.226108 0.219375 0.208005 0.223749 0.229603 0.219770 0.229697
chargesum: 0.00000
title: Mulliken charges with hydrogens summed into heavy atoms:
elementType: N N C C C C C C C C C C C
charge: -0.160857 -0.059103 -0.041445 0.166332 0.311359 -0.015862 0.064739 -0.344042 0.489646 -0.103431 -0.134958 -0.031387 -0.140991
polarizability: 2.05734459e+02 7.61418148e-01 1.23407838e+02 9.44205338e+00 4.28447812e+00 7.56987604e+01
1716.lowfreq: -13.9548 -5.8893 -0.0004 0.0001 0.0008 3.8164 16.7442 57.5045 63.2419
frequency: 15.3038 57.4973 63.2277 68.4508 143.9695 213.3197 229.9783 235.8560 285.8879 296.5671 331.2077 381.5633 436.1810 469.5303 474.9553 587.7738 596.0529 609.6130 668.6509 727.2748 736.6235 760.9500 772.5594 822.1610 827.4453 862.8056 864.4533 890.7985 934.9829 957.7384 971.7771 1003.1671 1044.8718 1048.5684 1069.6868 1093.0871 1125.5194 1154.0842 1208.7305 1215.7321 1233.1244 1266.7361 1279.4683 1286.0009 1298.7261 1338.0589 1368.2347 1384.6863 1391.4185 1396.5545 1452.8110 1455.4094 1468.4156 1471.9832 1472.6168 1478.4609 1485.2897 1492.9343 1531.9954 1590.2059 1641.9749 2973.5198 2974.5025 2976.4179 2979.5659 3033.7828 3051.4378 3067.2059 3076.8639 3079.8161 3080.0249 3123.5830 3129.5273 3164.0438 3594.7765
redmass: 2.5554 2.3622 1.2163 2.0537 3.7164 3.3358 2.5751 1.2099 3.0331 4.1368 2.6799 4.6327 3.0234 4.9542 3.7615 1.3346 3.7752 2.9688 4.9849 2.8641 1.4167 5.3576 3.5073 1.4548 3.4131 1.4065 1.4656 2.1008 2.7077 1.3373 4.9165 1.5134 1.5383 2.6019 1.6455 2.0913 1.5264 1.9680 1.6877 2.3178 1.4654 2.0945 1.3369 1.5024 1.7680 1.4601 3.1987 3.4128 1.2114 1.2618 3.3645 1.1922 1.0460 1.0713 1.2628 1.0469 1.0773 2.7270 4.3897 7.2401 7.3632 1.0369 1.0474 1.0509 1.0660 1.0961 1.0978 1.0976 1.0994 1.1001 1.0988 1.0891 1.0922 1.0957 1.0811
irintensity: 0.8781 0.7300 0.1415 0.0919 0.0881 4.2177 3.3291 0.4837 0.6611 2.6878 0.1596 5.2692 8.4794 3.2431 5.9563 65.1320 4.2998 31.0352 2.3244 1.4379 5.7615 0.1971 0.5891 58.6336 2.7980 6.8957 3.2880 4.7768 0.5232 1.2109 0.4963 8.5035 13.0918 0.9581 2.1066 17.4536 2.8160 0.2398 5.8353 10.5151 16.6721 19.9129 1.7143 4.0765 16.6207 2.3532 53.1028 1.0010 11.3166 7.4679 27.1565 11.1150 12.3688 1.6424 17.5539 15.9333 15.1513 16.2254 44.3588 2.6122 23.3611 50.5494 18.8327 36.7229 49.2115 4.7580 22.7923 8.6663 46.7333 53.8440 31.2129 17.4312 15.6575 12.2866 31.3379
temp: 298.150 k
press: 1.00000 atm
elementType: 7 7 6 6 6 6 6 6 6 6 6 6 6 1 1 1 1 1 1 1 1 1 1 1 1 1 1
symmnumber: 1
zpe: 594237.6 jmol-1
zpe.correction: 0.226333 hartree
zpe.thermalcorrener: 0.238881 hartree
zpe.thermalcorrenthalpy: 0.239826 hartree
zpe.thermalcorrgfe: 0.185719 hartree
zpe.sumelectzpe: -536.141162 hartree
zpe.sumelectthermal: -536.128614 hartree
zpe.sumelectthermalent: -536.127670 hartree
zpe.sumelectthermalfe: -536.181776 hartree
dipole: -0.7525 -3.6198 -0.2673
dipole: 3.7068
quadrupole: -66.1540 -74.9808 -80.9206
quadrupole: 3.3623 1.7234 2.2966
quadrupole: 7.8644 -0.9623 -6.9021 3.3623 1.7234 2.2966
hfenergy: -536.3674954 hartree
pointgroup: C01 [X(C11H14N2)]
dipole: 0.2908449 -1.4289492 -0.0200288 debye
polarizability: 205.7010487|-1.8886948|123.8022774|9.4814509|-0.0801816|75.3377307 unknown
InChI: InChI=1S/C11H14N2/c1-3-4-11-12-9-6-5-8(2)7-10(9)13-11/h5-7,13H,3-4H2,1-2H3
charge 0 multiplicity 1
27 atoms
N  0.683879 -0.955445 0.336588
N  0.807365 1.321441 0.310182
C  2.998233 0.083237 0.603769
C  1.510526 0.181113 0.427428
C  -0.635859 -0.516258 0.151427
C  -0.538778 0.916081 0.136403
C  3.746434 -0.381894 -0.67864
C  -1.862472 -1.19589 0.004659
C  -3.030498 -0.416329 -0.164878
C  -1.709587 1.688749 -0.033314
C  -2.935919 1.012582 -0.181472
C  5.274558 -0.425741 -0.470216
C  -4.387817 -1.080907 -0.33086
H  3.357407 1.086432 0.89141
H  3.243395 -0.606231 1.437401
H  3.383039 -1.383925 -0.984282
H  3.495359 0.309492 -1.504978
H  0.997236 -1.922383 0.397964
H  -1.925714 -2.290105 0.018493
H  -1.652357 2.78137 -0.047206
H  -3.856103 1.594675 -0.314495
H  5.665747 0.573198 -0.201806
H  5.548141 -1.123808 0.343706
H  5.793042 -0.755985 -1.388438
H  -4.85391 -0.8048 -1.29564
H  -4.309034 -2.181531 -0.298716
H  -5.087312 -0.770139 0.468211
