program: Gaussian 09
title: 000232264
version: EM64L-G09RevD.01
frameworkgroup: C1[X(C8H12N4O2S)]
method: RPBEPBE
basis: SDD
operation: Freq
keyword: #p
keyword: freq=noraman
keyword: PBEPBE/SDD
title: #p freq=noraman PBEPBE/SDD
converged: YES YES NO NO
title: Mulliken charges:
elementType: S O O N N N N C C C C C C C C H H H H H H H H H H H H
charge: 0.165600 -0.272696 -0.272707 -0.399974 -0.400041 -0.498126 -0.498153 0.382120 0.382055 -0.415672 -0.415637 -0.794825 -0.794808 0.217639 0.217679 0.224378 0.230882 0.297156 0.224437 0.230820 0.297188 0.331551 0.331558 0.308171 0.306613 0.308179 0.306611
chargesum: 0.00000
title: Mulliken charges with hydrogens summed into heavy atoms:
elementType: S O O N N N N C C C C C C C C
charge: 0.165600 -0.272696 -0.272707 -0.068423 -0.068482 0.116659 0.116637 0.382120 0.382055 -0.415672 -0.415637 -0.042408 -0.042364 0.217639 0.217679
polarizability: 2.13169645e+02 -1.33481380e-03 1.62339491e+02 3.90463014e+00 3.59874493e-03 7.52093993e+01
1716.lowfreq: -0.0011 -0.0003 0.0002 3.1742 7.0571 12.7906 37.8504 48.4084 62.1646
frequency: 37.8491 48.4055 62.1640 82.0520 91.9050 107.2470 133.4397 137.8186 142.9201 151.6718 169.0283 201.8267 262.8340 268.5009 279.1785 285.7599 299.8536 322.0375 324.5928 405.0065 413.5668 462.6331 503.6259 516.7015 546.2876 553.1115 604.4566 647.2594 729.8180 738.7221 767.7393 768.4589 785.7835 817.8689 883.4300 960.3732 1015.9626 1025.6852 1030.1886 1032.4263 1052.7575 1130.4556 1170.0703 1211.1030 1272.1069 1280.6765 1286.0541 1286.1758 1377.9749 1393.6641 1403.1045 1432.9408 1433.9166 1447.5118 1461.9113 1481.3602 1492.1162 1513.5180 1571.0619 1573.5679 1573.6832 1679.2859 1679.7511 2978.5894 2979.0465 3050.0554 3051.4088 3126.9175 3127.4276 3390.4304 3390.4853 3506.1477 3506.2049 3531.3156 3531.7453
redmass: 6.3459 5.6634 7.3618 1.3123 3.5279 2.3598 1.9101 1.4201 1.0704 1.7354 2.0493 3.6450 3.8994 5.2238 6.7394 3.8773 3.7612 4.6208 3.7676 7.9676 10.4459 5.1143 5.6736 5.9386 1.2496 1.2489 3.7400 3.8667 6.3821 7.0817 1.7090 1.7694 6.0291 6.0849 3.9987 6.7517 1.7109 5.5595 1.4580 2.1761 1.5956 2.6823 4.8233 5.8588 2.8275 2.5008 1.2273 1.1893 5.9816 1.2339 1.2463 1.6222 1.3330 1.3096 1.2201 1.1061 1.0490 3.7996 7.9141 5.2874 6.5142 1.0608 1.0605 1.0399 1.0390 1.0966 1.0966 1.0974 1.0972 1.0428 1.0428 1.0988 1.0988 1.0796 1.0797
irintensity: 0.2600 7.5962 0.4558 0.0005 0.3325 0.0409 27.8688 1.4337 0.2398 25.5326 1.5792 9.0585 0.1248 12.0715 0.3714 13.0729 0.0255 30.7211 11.8295 10.3729 13.9206 6.8924 37.0904 18.9651 30.0002 238.5912 9.6413 0.1085 1.2359 1.7835 94.5220 132.7498 66.4107 45.2684 8.0646 1.0215 54.4397 3.8994 6.5530 19.3979 0.0325 28.3905 0.9312 3.3644 190.8793 54.2164 8.0970 5.0311 0.1199 10.9383 71.3739 147.3719 9.1472 240.5427 65.2536 11.5966 37.5669 73.3343 112.8248 114.6996 96.0732 14.7627 46.4381 0.0625 46.7728 32.5131 0.3147 0.1892 2.6149 2.3555 0.5138 2.3388 2.4000 15.5122 54.1295
temp: 298.150 k
press: 1.00000 atm
elementType: 16 8 8 7 7 7 7 6 6 6 6 6 6 6 6 1 1 1 1 1 1 1 1 1 1 1 1
symmnumber: 1
zpe: 538276.1 jmol-1
zpe.correction: 0.205019 hartree
zpe.thermalcorrener: 0.222361 hartree
zpe.thermalcorrenthalpy: 0.223305 hartree
zpe.thermalcorrgfe: 0.159263 hartree
zpe.sumelectzpe: -1078.396550 hartree
zpe.sumelectthermal: -1078.379208 hartree
zpe.sumelectthermalent: -1078.378264 hartree
zpe.sumelectthermalfe: -1078.442305 hartree
dipole: -0.0007 -0.6346 0.0013
dipole: 0.6346
quadrupole: -99.6144 -93.3529 -95.1647
quadrupole: -0.0028 -3.9032 -0.0024
quadrupole: -3.5704 2.6911 0.8793 -0.0028 -3.9032 -0.0024
hfenergy: -1078.6015688 hartree
pointgroup: C01 [X(C8H12N4O2S1)]
dipole: -0.001433 0.2496662 -0.002722 debye
polarizability: 213.2709716|0.2477061|162.3339625|1.0479011|-0.7613748|75.1136018 unknown
InChI: InChI=1S/C8H12N4O2S/c1-3-4(2)6(8(14)12-10)15-5(3)7(13)11-9/h11-12H,9-10H2,1-2H3
charge 0 multiplicity 1
27 atoms
S  -0.01596 1.334861 -0.104328
O  -3.66763 -0.373913 0.246406
O  3.651168 -0.34609 -0.429063
N  -3.025555 1.7222 -0.513432
N  2.989808 1.757238 0.293345
N  -4.351085 2.227096 -0.535594
N  4.310522 2.274859 0.30548
C  -0.732615 -1.231535 -0.073114
C  0.72406 -1.225069 -0.09306
C  -1.296012 0.046504 -0.086843
C  1.27581 0.058115 -0.101701
C  -1.517676 -2.52184 -0.060609
C  1.520848 -2.508234 -0.084153
C  -2.734099 0.421625 -0.097135
C  2.710408 0.446556 -0.098789
H  -1.253899 -3.145197 -0.935975
H  -1.270128 -3.113906 0.841258
H  -2.599331 -2.32869 -0.057067
H  1.263952 -3.118644 0.802325
H  1.277386 -3.118039 -0.975226
H  2.600662 -2.30525 -0.09262
H  -2.313409 2.346247 -0.898168
H  2.272014 2.381344 0.66735
H  -4.948098 1.641623 -1.138116
H  -4.735963 2.262104 0.419295
H  4.913464 1.70559 0.917541
H  4.694355 2.297042 -0.650209
