program: Gaussian 09
title: 000232251
version: EM64L-G09RevD.01
frameworkgroup: C1[X(C9H20N2O)]
method: RPBEPBE
basis: SDD
operation: Freq
keyword: #p
keyword: freq=noraman
keyword: PBEPBE/SDD
title: #p freq=noraman PBEPBE/SDD
converged: YES YES NO NO
title: Mulliken charges:
elementType: O N N C C C C C C C C C H H H H H H H H H H H H H H H H H H H H
charge: -0.437407 -0.073240 -0.257781 -0.104838 -0.357258 -0.327535 -0.331394 -0.472200 -0.386470 -0.727311 -0.389407 -0.326309 0.224650 0.158598 0.207650 0.203897 0.165274 0.170334 0.203999 0.212557 0.219694 0.237461 0.195299 0.214228 0.242909 0.210369 0.197891 0.216273 0.181836 0.218092 0.181296 0.328841
chargesum: 0.00000
title: Mulliken charges with hydrogens summed into heavy atoms:
elementType: O N N C C C C C C C C C
charge: -0.108566 -0.073240 -0.020320 0.119812 0.008990 0.041636 0.042940 -0.039949 0.023058 -0.076142 0.008702 0.073080
polarizability: 1.41589429e+02 1.74930291e+00 1.08379508e+02 8.29640053e-01 -5.01672714e-01 9.56397112e+01
1716.lowfreq: -12.4614 -9.6210 -0.0005 0.0007 0.0009 12.3732 26.2123 38.9450 59.9730
frequency: 24.8039 37.5055 59.8959 92.8023 122.3874 142.7820 165.2370 211.4139 220.7461 222.6539 281.9686 302.3409 319.7956 349.9020 399.8441 438.2496 444.4020 458.6732 516.9417 587.5739 685.7284 745.8578 768.2575 798.2402 844.9906 887.0475 900.4136 915.7594 942.2497 959.2941 972.9032 1024.5736 1034.9497 1041.7762 1066.3630 1077.8845 1090.3267 1107.7254 1118.4045 1139.4849 1149.8745 1161.2690 1186.0031 1201.7226 1245.5914 1250.7213 1271.5868 1272.5326 1281.5159 1284.1650 1304.3803 1316.4725 1335.0723 1338.8887 1346.9369 1357.8820 1360.4282 1380.5905 1385.3049 1391.2846 1440.1495 1444.1393 1450.3438 1459.7647 1464.7060 1466.0067 1472.2437 1477.7941 1479.1728 1488.0981 2799.9812 2809.7009 2830.6772 2944.8928 2955.1103 2972.8816 2975.4776 2989.9537 2993.8104 3002.3108 3015.5966 3019.8942 3036.7635 3047.8501 3060.0086 3066.3218 3074.5418 3093.2311 3394.5480 3558.0361
redmass: 1.7670 4.1977 4.2397 2.6680 2.1537 2.5649 2.7989 1.7633 2.5705 1.6360 1.8634 1.8954 1.4382 2.2452 3.0736 3.5933 3.3227 2.1611 2.7658 2.0669 1.9886 1.0857 2.7083 1.1659 2.0868 1.7528 1.5767 1.3442 2.4189 2.8141 2.1785 1.7195 3.4684 3.3171 2.1149 2.6857 1.8821 2.2762 1.8319 2.2524 2.7017 1.7796 1.3779 1.7691 1.3892 1.3817 1.3467 1.3212 1.1059 1.2265 1.2748 1.3336 1.3229 1.3650 1.3808 1.2473 1.3561 1.2920 1.2901 1.3636 1.1282 1.0959 1.1014 1.0945 1.0745 1.0822 1.0625 1.0850 1.0638 1.0965 1.0704 1.0704 1.0695 1.0697 1.0633 1.0398 1.0624 1.0811 1.0611 1.0851 1.0885 1.0940 1.0871 1.1002 1.1043 1.0966 1.0976 1.0995 1.0737 1.0661
irintensity: 2.3772 1.1627 1.1335 2.3745 2.5605 0.6146 2.6921 2.3123 0.2919 0.9926 9.8612 44.7441 112.5797 6.0362 11.4952 3.3238 0.0955 14.8527 18.8201 6.9962 155.3814 8.6861 6.7003 1.3617 5.2918 4.1044 4.0564 22.5629 39.7087 40.4259 5.8385 9.0580 8.3958 9.1101 11.2314 34.5840 46.0412 14.1551 6.0607 7.1959 47.5495 15.3805 21.8366 14.5733 12.4468 11.7506 7.0907 4.3412 2.8908 1.0521 14.5181 3.3757 5.0363 1.2579 2.3848 0.0746 8.5760 16.2079 33.2489 8.9629 6.7478 12.0245 2.2458 6.1281 0.3435 0.2299 15.6965 2.0035 3.9129 13.9370 52.7704 66.1393 197.1474 61.0599 30.1773 29.4795 30.2620 18.4498 49.0796 23.0332 46.0911 7.0816 47.4542 61.0720 35.8731 56.3716 62.4749 26.9780 3.7288 6.8618
temp: 298.150 k
press: 1.00000 atm
elementType: 8 7 7 6 6 6 6 6 6 6 6 6 1 1 1 1 1 1 1 1 1 1 1 1 1 1 1 1 1 1 1 1
symmnumber: 1
zpe: 751424.6 jmol-1
zpe.correction: 0.286203 hartree
zpe.thermalcorrener: 0.300303 hartree
zpe.thermalcorrenthalpy: 0.301247 hartree
zpe.thermalcorrgfe: 0.244148 hartree
zpe.sumelectzpe: -538.638260 hartree
zpe.sumelectthermal: -538.624160 hartree
zpe.sumelectthermalent: -538.623216 hartree
zpe.sumelectthermalfe: -538.680314 hartree
dipole: -0.8076 0.0494 2.7394
dipole: 2.8564
quadrupole: -97.2431 -73.9698 -73.7717
quadrupole: 6.0558 4.7242 0.9739
quadrupole: -15.5816 7.6917 7.8898 6.0558 4.7242 0.9739
hfenergy: -538.9244627 hartree
pointgroup: C01 [X(C9H20N2O1)]
dipole: 0.3056641 0.0101921 1.0813606 debye
polarizability: 141.6380437|1.3476269|108.3637382|-0.3622904|0.1339006|95.6068664 unknown
InChI: InChI=1S/C9H20N2O/c1-9-8-11(6-4-10-9)5-2-3-7-12/h9-10,12H,2-8H2,1H3
charge 0 multiplicity 1
32 atoms
O  -5.750115 0.42289 -0.137384
N  0.598591 0.035585 -0.043117
N  3.377397 -0.891351 0.085676
C  3.038703 0.474753 -0.400545
C  1.706527 0.994919 0.204253
C  0.916498 -1.297295 0.52737
C  -0.711124 0.570575 0.401858
C  2.24054 -1.830319 -0.073101
C  -1.919104 -0.189976 -0.185114
C  4.205276 1.433534 -0.116141
C  -3.258543 0.50788 0.146773
C  -4.47299 -0.260327 -0.404833
H  2.88787 0.393558 -1.495795
H  1.85974 1.178512 1.303652
H  1.438667 1.962624 -0.262018
H  0.095961 -1.998811 0.291499
H  1.009026 -1.246967 1.647262
H  -0.792425 0.586646 1.521904
H  -0.766902 1.624897 0.065344
H  2.505814 -2.797379 0.392565
H  2.089172 -2.003211 -1.155424
H  3.700601 -0.855104 1.066019
H  -1.9465 -1.229414 0.199058
H  -1.786494 -0.256696 -1.282414
H  5.131622 1.047257 -0.575033
H  4.003217 2.44017 -0.524531
H  4.378745 1.538781 0.973426
H  -3.268161 1.532504 -0.273746
H  -3.360047 0.611923 1.249136
H  -4.425577 -0.322797 -1.505321
H  -4.487588 -1.296055 0.001201
H  -5.853396 0.52949 0.842222
