program: Gaussian 09
title: 000232253
version: EM64L-G09RevD.01
frameworkgroup: C1[X(C13H19ClN2S)]
method: RPBEPBE
basis: SDD
operation: Freq
keyword: #p
keyword: freq=noraman
keyword: PBEPBE/SDD
title: #p freq=noraman PBEPBE/SDD
converged: NO YES NO NO
title: Mulliken charges:
elementType: Cl S N N C C C C C C C C C C C C C H H H H H H H H H H H H H H H H H H H
charge: -0.078936 0.147641 -0.049206 -0.172514 -0.358202 -0.382289 -0.372882 -0.370879 -0.650132 0.490032 -0.354100 -0.352637 -0.573930 -0.230009 -0.230471 -0.119860 -0.653444 0.193642 0.236469 0.213519 0.196271 0.221304 0.206161 0.207095 0.217325 0.243626 0.251540 0.219236 0.222367 0.271150 0.244969 0.247816 0.247256 0.226077 0.228150 0.217845
chargesum: 0.00000
title: Mulliken charges with hydrogens summed into heavy atoms:
elementType: Cl S N N C C C C C C C C C C C C C
charge: -0.078936 0.147641 -0.049206 -0.172514 0.071909 0.027501 0.054583 0.053541 -0.154967 0.490032 -0.134864 -0.130270 -0.057811 0.017807 0.016785 -0.119860 0.018628
polarizability: 2.74260456e+02 -4.15496282e+00 1.44710669e+02 -5.05216770e+00 -1.31916779e+01 1.43685949e+02
1716.lowfreq: -31.3149 -21.9964 -8.0911 -5.6011 0.0010 0.0018 0.0032 9.0073 29.4815
frequency: -31.1909 -3.2623 29.1193 42.8440 65.7501 85.0398 93.9478 143.9137 153.4382 203.0871 214.5674 232.3860 241.3100 259.4854 279.5066 310.4642 327.3046 361.5317 385.5812 409.1583 432.5508 448.1024 470.8026 498.8358 546.1694 618.5342 626.8606 646.2612 682.3625 691.1072 730.0713 773.3416 787.6956 789.5511 804.0588 845.5260 896.6376 911.7887 925.1480 939.4513 979.6607 980.8967 995.2079 1001.5193 1035.2878 1052.5533 1064.7691 1069.1592 1085.2539 1089.8206 1122.3137 1145.4675 1152.2627 1172.9578 1202.5051 1211.8684 1233.6774 1237.1889 1248.5453 1265.5345 1273.1036 1298.9001 1308.9560 1312.1365 1346.8473 1351.5810 1355.9002 1373.7231 1377.4765 1389.6409 1392.4331 1415.1114 1443.3744 1455.7983 1457.7082 1462.1406 1467.2810 1469.2194 1470.6489 1483.8248 1493.3583 1570.3165 1611.2468 2862.9078 2868.2270 2918.2884 2920.1630 2928.5136 2982.1604 3006.0492 3036.1281 3049.1347 3058.5281 3066.1852 3069.3151 3075.8550 3081.0413 3097.4073 3153.3232 3153.8550 3175.8500 3180.1523
redmass: 3.3431 3.8759 3.9385 3.2779 2.6034 6.7939 4.1670 5.9122 3.5642 3.1894 2.8290 2.5458 1.2410 3.2168 4.0654 3.3066 3.5492 3.2608 2.7961 2.9622 5.6055 4.7440 2.7890 2.6150 3.4937 4.2049 7.0540 3.1248 4.7389 2.9773 4.6817 3.3442 1.2761 1.1283 1.8780 1.5541 1.6681 3.7771 1.3546 1.3517 3.8507 1.9126 1.8923 2.5627 1.2192 1.7482 2.0945 2.2225 2.5079 2.4533 1.4631 2.2525 2.2374 2.4581 1.1964 1.0957 1.2573 1.5030 1.4998 1.2054 1.2689 1.4158 1.3503 1.4873 1.8936 2.0067 1.2912 2.4445 1.5239 1.3942 1.2064 3.6163 1.0908 1.0790 1.0843 1.1071 1.0868 1.0416 1.1150 1.0479 2.3502 7.1330 6.3100 1.0709 1.0697 1.0679 1.0687 1.0701 1.0354 1.0570 1.0895 1.0894 1.0947 1.0900 1.1040 1.0992 1.0898 1.1044 1.0887 1.0884 1.0940 1.0950
irintensity: 0.2565 0.6685 0.3468 0.2545 0.3330 4.2490 1.3957 3.0242 1.0716 0.7801 9.7889 2.6010 0.3689 2.2215 3.5189 8.2412 9.4082 5.1701 0.5664 0.0661 2.6219 1.0647 0.7229 24.7340 4.6255 1.4162 0.1428 50.1077 28.3871 0.9477 11.3699 14.6384 1.5554 7.3350 80.7658 0.0494 3.5888 25.8832 0.6839 0.1516 39.3114 7.1754 25.9231 75.6582 0.9046 0.3559 1.7015 13.1908 10.3223 5.3267 4.8899 113.2801 52.1480 17.8108 0.1440 4.3569 35.8649 84.2989 124.8494 32.4888 5.4171 34.9458 22.4112 31.4800 5.7183 33.5443 2.3731 2.8943 18.9372 4.0490 17.8172 0.5263 5.2780 10.8181 3.6911 85.6905 15.7917 7.7782 6.8738 8.5617 247.5135 1.7230 88.4369 45.1687 115.4254 66.4432 68.3055 108.8406 35.9596 23.1933 38.4135 11.5639 23.5176 27.6310 4.1434 24.7832 24.1820 44.1148 5.7031 7.9727 21.8879 5.7314
temp: 298.150 k
press: 1.00000 atm
elementType: 17 16 7 7 6 6 6 6 6 6 6 6 6 6 6 6 6 1 1 1 1 1 1 1 1 1 1 1 1 1 1 1 1 1 1 1
symmnumber: 1
zpe: 780644.4 jmol-1
zpe.correction: 0.297332 hartree
zpe.thermalcorrener: 0.313527 hartree
zpe.thermalcorrenthalpy: 0.314471 hartree
zpe.thermalcorrgfe: 0.252380 hartree
zpe.sumelectzpe: -1473.078432 hartree
zpe.sumelectthermal: -1473.062237 hartree
zpe.sumelectthermalent: -1473.061293 hartree
zpe.sumelectthermalfe: -1473.123383 hartree
dipole: 3.2442 -1.3110 1.0439
dipole: 3.6515
quadrupole: -149.4554 -111.9610 -111.9148
quadrupole: -0.4620 6.3828 -5.0975
quadrupole: -25.0116 12.4827 12.5289 -0.4620 6.3828 -5.0975
hfenergy: -1473.3757635 hartree
pointgroup: C01 [X(C13H19Cl1N2S1)]
dipole: -1.2717833 0.5208702 0.4184416 debye
polarizability: 273.3653615|-9.5779015|142.8060444|8.8600939|12.6200503|146.4856681 unknown
InChI: InChI=1S/C13H19ClN2S/c1-2-17-11-15-7-9-16(10-8-15)13-5-3-12(14)4-6-13/h3-6H,2,7-11H2,1H3
charge 0 multiplicity 1
36 atoms
Cl 6.322984 -0.942607 0.340889
S  -5.064442 -0.069107 -0.757148
N  -2.462444 0.85829 -0.225916
N  0.400384 0.427566 -0.176502
C  -1.774395 0.307059 -1.409799
C  -1.579939 1.811728 0.478371
C  -0.489454 -0.426957 -0.998908
C  -0.287111 1.115122 0.938583
C  -3.816075 1.341855 -0.483828
C  1.764549 0.073282 -0.03038
C  2.420514 -0.788323 -0.967351
C  2.562556 0.583849 1.043207
C  -4.940041 -0.880692 0.954596
C  3.792227 -1.091017 -0.859493
C  3.935483 0.28388 1.15246
C  4.545144 -0.54786 0.197075
C  -5.561711 -2.28438 0.915942
H  -1.518364 1.118318 -2.137527
H  -2.455182 -0.405846 -1.908393
H  -2.103791 2.206299 1.368516
H  -1.308747 2.678562 -0.175649
H  -0.760174 -1.353606 -0.443994
H  0.030618 -0.722232 -1.923337
H  0.373014 1.896248 1.350004
H  -0.527534 0.397083 1.755647
H  -3.920063 1.954915 -1.407856
H  -4.159326 1.937725 0.379012
H  1.87404 -1.235688 -1.800535
H  2.126644 1.217154 1.819007
H  -3.86387 -0.913606 1.197391
H  -5.461095 -0.229842 1.678686
H  4.264736 -1.748952 -1.595416
H  4.517942 0.692156 1.98418
H  -6.625027 -2.249214 0.617338
H  -5.026156 -2.935986 0.203133
H  -5.506893 -2.750074 1.917894
