program: Gaussian 09
title: 000232248
version: EM64L-G09RevD.01
frameworkgroup: C1[X(C11H24N2O)]
method: RPBEPBE
basis: SDD
operation: Freq
keyword: #p
keyword: freq=noraman
keyword: PBEPBE/SDD
title: #p freq=noraman PBEPBE/SDD
converged: YES YES NO NO
title: Mulliken charges:
elementType: O N N C C C C C C C C C C C H H H H H H H H H H H H H H H H H H H H H H H H
charge: -0.459816 -0.114523 -0.084065 0.017148 -0.399347 -0.377483 -0.375049 -0.311029 -0.340985 -0.764261 -0.412557 -0.423081 -0.315138 -0.672682 0.188718 0.180071 0.199650 0.204612 0.184044 0.207604 0.187612 0.210793 0.178821 0.189390 0.202264 0.212374 0.229748 0.219630 0.203346 0.202575 0.222395 0.224007 0.217889 0.181529 0.239073 0.205351 0.202365 0.339007
chargesum: 0.00000
title: Mulliken charges with hydrogens summed into heavy atoms:
elementType: O N N C C C C C C C C C C C
charge: -0.120810 -0.114523 -0.084065 0.205866 -0.019626 0.011173 0.020167 0.078585 0.050669 -0.102509 -0.006637 0.023321 0.084279 -0.025892
polarizability: 1.60718886e+02 2.65049497e-01 1.31023348e+02 -2.12875017e+00 4.24173414e-01 1.18455917e+02
1716.lowfreq: -19.7268 -8.5334 -0.0005 0.0003 0.0004 19.1623 27.9189 37.0050 45.5968
frequency: 27.7303 36.6236 45.4610 67.1574 80.2171 122.1589 155.5408 173.2711 195.5402 205.5021 219.4963 268.2167 275.3557 284.7502 291.3578 302.6117 313.3178 365.0164 375.6297 421.1019 454.9748 466.4341 519.9391 557.4501 590.2907 704.7997 764.6476 795.0504 819.3715 860.7093 869.6005 874.2469 901.9438 910.9495 938.0221 961.5063 977.0576 1001.9051 1026.0331 1045.8639 1064.3710 1070.8528 1085.5717 1093.1921 1098.0035 1122.3978 1132.1653 1146.8164 1150.2517 1166.6507 1172.4606 1200.4992 1217.8762 1225.0250 1255.8197 1265.1889 1268.6944 1273.9422 1280.7596 1295.3169 1303.7967 1332.6347 1334.5983 1343.1879 1347.0605 1362.3603 1371.0775 1377.0184 1381.1465 1390.1190 1392.1962 1409.2203 1449.1994 1457.6830 1461.2981 1463.9323 1468.1365 1471.8158 1477.0719 1479.4792 1480.1557 1486.1728 1488.6239 1491.5669 2825.6329 2830.7172 2837.2818 2847.4248 2848.8027 2864.4729 2940.2903 2977.7127 2983.2822 2983.7126 2997.3564 3005.3713 3007.6933 3020.6973 3021.5687 3037.9930 3048.6380 3051.6940 3063.3667 3070.8406 3077.7445 3087.5220 3089.0539 3566.3064
redmass: 3.6276 3.9661 2.9130 3.4950 2.4095 2.5535 2.6363 1.7058 1.2273 1.4114 2.4123 1.8921 2.1247 1.6578 1.7574 2.1800 1.9665 2.3263 2.4497 3.5580 3.1351 2.4019 2.6084 2.7208 2.3047 2.3238 1.9761 1.3390 1.5601 2.5261 1.7510 1.8188 1.4378 1.4381 1.8065 1.8471 4.3682 2.0667 1.9064 2.1872 1.7476 2.0032 2.2398 2.0421 2.3556 2.2744 2.0312 2.6992 1.7980 1.7491 1.7819 1.3027 1.4671 1.7729 1.2570 1.2664 1.2561 1.2507 1.2451 1.2793 1.4122 1.2508 1.3940 1.4114 1.4248 1.3220 1.3971 1.3749 1.2537 1.4197 1.2823 1.4692 1.0831 1.0830 1.0785 1.0797 1.0528 1.0790 1.0731 1.0669 1.0839 1.0855 1.0554 1.0734 1.0743 1.0721 1.0724 1.0743 1.0704 1.0694 1.0608 1.0387 1.0462 1.0480 1.0821 1.0873 1.0787 1.0888 1.0970 1.0891 1.0864 1.0894 1.1025 1.0993 1.0981 1.0997 1.0995 1.0664
irintensity: 0.0987 0.0879 0.2676 1.3944 8.4726 1.5362 4.1543 1.1911 0.6340 0.2878 0.4614 7.0069 36.2631 58.7427 59.3426 5.3586 7.4530 1.4091 1.3238 5.4482 0.3486 1.3485 2.6849 9.7150 5.9610 8.8189 8.6927 3.7291 4.4949 0.9738 1.3055 1.7524 4.3174 5.3839 28.9700 8.0422 100.3791 9.3199 8.5631 6.8383 4.2864 13.7873 1.3469 30.1751 11.6330 9.5827 1.1845 46.9618 19.9330 35.7666 10.0678 19.1855 0.3701 13.1092 19.4698 7.5167 7.2422 15.2793 2.8442 11.4515 13.2320 20.4662 4.5590 9.9427 1.1261 12.8742 3.1046 3.3819 25.2875 0.8985 15.9116 1.6216 1.3571 8.8936 4.1309 3.1376 19.0625 6.9497 5.2296 1.0086 14.2722 4.9032 15.1130 18.8158 33.8344 94.6300 45.7137 72.0842 5.1488 320.6279 57.7662 46.0970 39.2272 22.2624 17.3146 28.9401 40.1601 39.3357 21.6612 42.8312 22.5687 37.6584 68.9969 82.5098 37.1420 21.4010 62.5983 2.3264
temp: 298.150 k
press: 1.00000 atm
elementType: 8 7 7 6 6 6 6 6 6 6 6 6 6 6 1 1 1 1 1 1 1 1 1 1 1 1 1 1 1 1 1 1 1 1 1 1 1 1
symmnumber: 1
zpe: 896944.6 jmol-1
zpe.correction: 0.341628 hartree
zpe.thermalcorrener: 0.358270 hartree
zpe.thermalcorrenthalpy: 0.359214 hartree
zpe.thermalcorrgfe: 0.296560 hartree
zpe.sumelectzpe: -617.076855 hartree
zpe.sumelectthermal: -617.060213 hartree
zpe.sumelectthermalent: -617.059269 hartree
zpe.sumelectthermalfe: -617.121923 hartree
dipole: 1.1265 0.8940 -1.4204
dipole: 2.0214
quadrupole: -96.9449 -87.0831 -85.6910
quadrupole: -4.5101 3.4425 1.6799
quadrupole: -7.0386 2.8232 4.2153 -4.5101 3.4425 1.6799
hfenergy: -617.4184832 hartree
pointgroup: C01 [X(C11H24N2O1)]
dipole: -0.4580063 0.3383022 0.5551888 debye
polarizability: 160.7843442|0.1557827|131.0314438|-1.3442721|-0.2780908|118.3823633 unknown
InChI: InChI=1S/C11H24N2O/c1-3-5-13-8-7-12(6-4-9-14)10-11(13)2/h11,14H,3-10H2,1-2H3
charge 0 multiplicity 1
38 atoms
O  5.072684 -1.141439 0.855272
N  -1.715484 -0.012657 0.140727
N  1.13954 0.481995 -0.239987
C  -1.105488 1.293235 0.548028
C  0.137935 1.569261 -0.327699
C  -0.704774 -1.098591 0.225242
C  0.51793 -0.798477 -0.650646
C  -2.949299 -0.353543 0.898628
C  2.373796 0.807322 -1.000003
C  -2.092401 2.470602 0.403809
C  -3.733516 -1.551262 0.311587
C  3.541221 -0.162416 -0.72597
C  3.893413 -0.258128 0.76052
C  -4.141504 -1.342468 -1.161967
H  -0.754378 1.237168 1.612527
H  -0.208918 1.726131 -1.382993
H  0.611337 2.507538 0.018654
H  -1.162556 -2.041386 -0.122178
H  -0.362303 -1.252293 1.281441
H  1.251513 -1.616399 -0.534609
H  0.200375 -0.769559 -1.724919
H  -3.617678 0.524756 0.874846
H  -2.716678 -0.560628 1.977163
H  2.178634 0.835947 -2.104047
H  2.678698 1.8312 -0.704532
H  -1.547837 3.428756 0.491262
H  -2.583282 2.43723 -0.585959
H  -2.873357 2.468532 1.183033
H  -3.148759 -2.486563 0.41009
H  -4.637991 -1.693205 0.936636
H  3.320907 -1.176628 -1.107947
H  4.431682 0.19257 -1.27906
H  3.035539 -0.667244 1.330737
H  4.123882 0.753707 1.160682
H  -3.249428 -1.172482 -1.789443
H  -4.691177 -2.218085 -1.553989
H  -4.793024 -0.454374 -1.267916
H  5.300946 -1.28002 1.808676
