program: Gaussian 09
title: 000232249
version: EM64L-G09RevD.01
frameworkgroup: C1[X(C12H26N2O)]
method: RPBEPBE
basis: SDD
operation: Freq
keyword: #p
keyword: freq=noraman
keyword: PBEPBE/SDD
title: #p freq=noraman PBEPBE/SDD
converged: YES YES NO NO
title: Mulliken charges:
elementType: O N N C C C C C C C C C C C C H H H H H H H H H H H H H H H H H H H H H H H H H H
charge: -0.437726 -0.102545 -0.068607 0.005322 -0.405788 -0.376863 -0.367594 -0.330810 -0.298335 -0.764107 -0.391134 -0.395304 -0.389724 -0.692548 -0.326595 0.192318 0.178679 0.200338 0.204867 0.181933 0.199012 0.181171 0.169063 0.204951 0.163694 0.211878 0.212596 0.228410 0.221350 0.197510 0.213379 0.213910 0.203884 0.216056 0.182251 0.208550 0.209562 0.219277 0.217818 0.181089 0.328810
chargesum: 0.00000
title: Mulliken charges with hydrogens summed into heavy atoms:
elementType: O N N C C C C C C C C C C C C
charge: -0.108915 -0.102545 -0.068607 0.197639 -0.026771 0.009937 0.012589 0.043204 0.077237 -0.101750 0.019756 0.022489 0.008584 -0.055159 0.072312
polarizability: 1.89883104e+02 -2.03755381e+00 1.39576511e+02 -2.94559446e+00 4.02198141e-01 1.19219620e+02
1716.lowfreq: -17.2507 -4.0289 -0.0011 -0.0004 0.0005 9.3756 28.4759 39.9306 42.9996
frequency: 28.3512 39.7973 42.5699 53.6811 66.7174 91.3898 111.3921 130.7035 137.1830 166.0911 182.2643 200.9223 214.3059 225.0358 242.0965 286.9121 306.3010 320.5957 339.9152 349.1489 392.1003 421.3319 451.8332 473.3621 493.6941 541.2396 613.4996 738.7558 748.6571 755.2858 799.3249 807.4654 864.5206 879.1479 902.1314 915.6978 921.4630 943.5612 961.1598 994.2024 1031.1692 1040.7909 1047.2543 1054.2600 1065.5007 1071.3473 1084.9133 1092.3999 1107.4119 1124.6291 1128.7877 1138.7478 1151.7291 1162.8513 1170.2960 1197.8592 1220.7926 1246.5741 1249.4603 1252.8970 1269.1402 1283.5934 1285.8951 1292.6576 1296.1310 1308.9604 1311.7299 1321.3010 1334.0690 1348.0432 1352.9333 1369.0083 1372.2712 1380.7509 1382.8924 1385.6449 1391.4836 1398.2723 1449.2811 1459.9148 1461.8895 1462.8163 1465.7200 1467.2345 1473.8949 1476.9704 1477.9725 1479.6366 1486.0545 1488.2350 1489.5970 2820.2297 2822.6276 2834.4535 2847.3904 2851.3715 2864.7631 2945.1874 2956.5370 2972.8093 2975.8040 2983.4255 2985.8344 3002.5186 3021.0934 3024.2315 3029.7512 3042.2487 3046.2810 3048.8754 3054.4061 3071.9215 3074.3609 3075.3008 3076.9331 3087.8069 3557.7512
redmass: 3.8170 3.8075 1.6926 1.6762 3.8665 2.8814 2.3664 2.1659 3.2744 2.5703 1.2234 3.5626 2.1439 1.1852 2.3641 2.7274 1.9380 1.3223 2.3910 2.5266 2.5610 3.8622 3.6474 2.6058 3.1507 3.1734 2.2591 3.0185 1.0835 1.1257 1.6800 1.5997 2.1824 1.3494 1.4386 1.5544 1.3909 2.2984 2.4266 2.3190 3.1586 3.4208 3.0670 2.6539 1.7387 1.9798 2.9475 1.8758 1.9154 1.8573 2.1668 2.3143 2.4442 1.8281 1.9606 2.2418 1.3242 1.3014 1.3605 1.3055 1.3319 1.2066 1.0858 1.2166 1.1859 1.3896 1.2737 1.3587 1.2615 1.3733 1.4161 1.4193 1.4210 1.3733 1.2850 1.2396 1.2408 1.4386 1.0808 1.0875 1.0767 1.0822 1.0705 1.0901 1.0609 1.0510 1.0579 1.0834 1.0528 1.0958 1.0853 1.0720 1.0704 1.0740 1.0732 1.0724 1.0704 1.0695 1.0633 1.0356 1.0624 1.0363 1.0600 1.0849 1.0939 1.0886 1.0922 1.0906 1.0941 1.0986 1.0876 1.1008 1.0978 1.0991 1.0984 1.0996 1.0661
irintensity: 0.5734 0.3437 2.7582 0.6821 0.4083 1.8957 1.7732 2.6627 0.3092 1.5747 0.7968 1.6060 1.2145 0.8413 0.6154 6.9796 15.5818 130.7647 4.3894 14.4912 3.1014 5.6944 1.8450 0.4499 6.9757 3.9124 1.9173 3.5461 8.4166 6.3667 10.0785 10.8227 1.3029 3.6199 2.2845 8.1823 19.3890 56.6365 26.3527 12.0899 1.9896 17.0910 3.0128 28.7254 5.2746 0.9057 32.4861 30.7804 16.2578 7.7319 7.3822 25.2110 51.8450 13.8970 18.5631 12.6678 9.2092 2.0960 13.7762 4.4134 18.4074 7.3948 9.6670 0.2649 8.8492 1.0463 15.1526 4.0256 17.9775 0.3805 4.1890 10.8377 6.5232 12.4497 18.6808 26.8947 10.0597 5.0049 0.7563 11.2068 3.7480 0.9645 0.9620 0.2400 8.8936 8.7169 5.6037 5.2160 3.2354 12.7909 19.1069 66.6562 75.9917 65.5994 12.6988 19.2967 310.9900 61.6483 30.0697 44.7410 28.8923 27.2274 22.0390 26.6939 11.5320 33.2641 9.9496 49.9915 9.7985 32.9627 52.3018 71.4081 57.2126 88.5454 31.3236 35.2238 7.1382
temp: 298.150 k
press: 1.00000 atm
elementType: 8 7 7 6 6 6 6 6 6 6 6 6 6 6 6 1 1 1 1 1 1 1 1 1 1 1 1 1 1 1 1 1 1 1 1 1 1 1 1 1 1
symmnumber: 1
zpe: 969521.8 jmol-1
zpe.correction: 0.369271 hartree
zpe.thermalcorrener: 0.387662 hartree
zpe.thermalcorrenthalpy: 0.388606 hartree
zpe.thermalcorrgfe: 0.321398 hartree
zpe.sumelectzpe: -656.300153 hartree
zpe.sumelectthermal: -656.281762 hartree
zpe.sumelectthermalent: -656.280818 hartree
zpe.sumelectthermalfe: -656.348026 hartree
dipole: 1.8886 -0.2011 1.2828
dipole: 2.2919
quadrupole: -113.6848 -91.9698 -95.6693
quadrupole: 0.0365 -12.4984 -0.9590
quadrupole: -13.2435 8.4715 4.7720 0.0365 -12.4984 -0.9590
hfenergy: -656.6694244 hartree
pointgroup: C01 [X(C12H26N2O1)]
dipole: -0.7411652 -0.0948579 -0.5047249 debye
polarizability: 189.7673387|3.1537793|139.692728|-2.9414378|-0.4389122|119.2191677 unknown
InChI: InChI=1S/C12H26N2O/c1-3-6-14-9-8-13(11-12(14)2)7-4-5-10-15/h12,15H,3-11H2,1-2H3
charge 0 multiplicity 1
41 atoms
O  6.894236 -0.377404 0.058106
N  -2.301459 -0.002071 -0.152166
N  0.583108 0.417151 0.090575
C  -1.755903 1.288801 0.379453
C  -0.348934 1.52882 -0.212692
C  -1.360121 -1.11292 0.151737
C  0.030312 -0.849408 -0.441639
C  1.959547 0.706256 -0.380395
C  -3.675224 -0.296629 0.340612
C  -2.659452 2.490788 0.033537
C  3.019023 -0.255868 0.196046
C  -4.331486 -1.52358 -0.329386
C  4.45711 0.173905 -0.175257
C  -5.829344 -1.630911 0.032379
C  5.518033 -0.796585 0.374115
H  -1.63983 1.224527 1.493411
H  -0.460702 1.686156 -1.317626
H  0.064567 2.457391 0.224215
H  -1.756119 -2.04618 -0.284296
H  -1.255793 -1.264469 1.257197
H  0.697783 -1.685812 -0.167975
H  -0.050564 -0.819654 -1.559369
H  2.023144 0.696784 -1.501881
H  2.209479 1.736246 -0.056861
H  -3.688305 -0.436836 1.455344
H  -4.309975 0.579662 0.119934
H  -2.122786 3.435242 0.239247
H  -2.928589 2.469153 -1.038378
H  -3.588549 2.509487 0.6283
H  2.844416 -1.286995 -0.171133
H  2.902308 -0.282844 1.296904
H  -4.208294 -1.430218 -1.42569
H  -3.822542 -2.457924 -0.024629
H  4.666307 1.187428 0.21914
H  4.552124 0.233329 -1.281392
H  -5.971021 -1.708461 1.127305
H  -6.388581 -0.74253 -0.316961
H  -6.289667 -2.522783 -0.430085
H  5.489339 -0.819606 1.476871
H  5.324129 -1.826494 0.000512
H  6.989577 -0.31964 -0.926424
