program: Gaussian 09
title: 000232256
version: EM64L-G09RevD.01
frameworkgroup: C1[X(C17H19ClN2S)]
method: RPBEPBE
basis: SDD
operation: Freq
keyword: #p
keyword: freq=noraman
keyword: PBEPBE/SDD
title: #p freq=noraman PBEPBE/SDD
converged: YES YES NO NO
title: Mulliken charges:
elementType: Cl S N N C C C C C C C C C C C C C C C C C H H H H H H H H H H H H H H H H H H H
charge: -0.065421 0.184833 -0.063296 -0.168550 -0.353483 -0.372488 -0.409591 -0.398494 -0.665249 0.534144 -0.297677 -0.339995 -0.221061 -0.241804 -0.173824 -0.245815 -0.277336 -0.189147 -0.210774 -0.233298 -0.241274 0.199100 0.231371 0.212061 0.217509 0.205902 0.231135 0.235316 0.212100 0.252306 0.272189 0.249513 0.252177 0.227569 0.234032 0.248009 0.288220 0.227681 0.225211 0.228200
chargesum: 0.00000
title: Mulliken charges with hydrogens summed into heavy atoms:
elementType: Cl S N N C C C C C C C C C C C C C C C C C
charge: -0.065421 0.184833 -0.063296 -0.168550 0.076988 0.057082 0.027446 0.048922 -0.140754 0.534144 -0.297677 -0.090482 0.031116 -0.014235 -0.173824 -0.011782 -0.029327 0.099072 0.016906 -0.008086 -0.013075
polarizability: 3.12284670e+02 2.58497803e+00 1.97383826e+02 -1.27206827e+00 -4.32056737e-01 1.70369530e+02
1716.lowfreq: -11.9491 -3.1446 -0.0025 -0.0024 -0.0015 2.1143 16.4952 17.4640 29.0875
frequency: 9.0223 16.7599 28.6404 45.9931 67.9290 83.0265 114.5078 118.4782 165.6365 178.6348 210.9491 226.4752 242.7452 266.3186 275.0390 306.5362 325.7010 365.4660 383.9563 393.5357 401.6890 405.8925 446.3163 469.9903 479.5888 486.5851 524.3476 549.0047 611.1374 615.2374 656.0284 668.3249 679.0115 698.6394 711.5872 730.7094 749.0026 751.9394 758.4970 840.7749 852.0192 854.0212 901.2380 922.6737 925.0505 929.4094 970.0583 977.9216 980.2609 984.8451 998.5599 1000.5078 1010.8748 1018.0926 1040.7798 1051.6804 1065.6776 1069.1147 1074.0738 1090.1438 1119.5496 1135.4065 1150.9955 1163.3007 1170.9382 1173.0515 1184.4457 1202.7043 1228.1577 1236.4439 1267.1183 1275.3592 1297.8322 1303.7100 1308.3772 1339.3911 1350.0560 1357.2489 1367.0845 1372.9222 1377.2598 1380.8754 1427.2210 1427.4674 1439.2135 1453.7369 1455.8627 1459.0374 1461.5408 1469.1052 1479.8273 1559.6857 1582.4855 1590.6001 1605.7933 2879.5491 2893.0068 2903.4743 2913.7355 2919.4595 3034.4682 3038.4127 3057.8319 3076.3739 3097.9856 3121.7309 3129.8566 3133.9514 3140.4024 3149.1195 3150.8710 3161.0130 3163.9135 3174.8771
redmass: 5.0782 5.7862 4.5665 6.5479 4.5206 4.4689 5.3320 4.4632 5.0296 4.2733 5.1654 4.8455 3.6081 4.9021 2.1590 3.0461 2.5196 4.5635 5.6896 2.8185 5.3913 3.2743 3.3440 2.9667 3.2637 4.4671 4.3886 3.5421 6.1470 3.3432 4.8322 4.9026 5.8296 2.4246 3.6342 4.2213 1.5037 1.3820 2.8162 1.4313 1.5118 1.2559 1.7285 2.5893 1.6595 1.3992 1.3421 1.9683 1.4570 3.9645 1.4697 2.2252 5.5980 3.2741 2.2889 1.7397 1.9827 2.1981 1.7251 2.1997 1.8074 2.6146 2.7984 1.8260 1.0529 1.1506 1.1247 1.1079 1.3784 1.4710 1.5139 1.2430 1.4236 1.4611 1.3393 1.3153 1.7259 1.6177 2.6330 8.0131 1.6930 1.4237 2.1597 2.3855 1.1121 1.0908 1.0962 1.6335 1.3137 1.1289 2.4918 5.9350 6.2571 5.8737 6.8522 1.0698 1.0692 1.0686 1.0702 1.0680 1.0910 1.0915 1.0913 1.0942 1.0899 1.0850 1.0878 1.0856 1.0931 1.0963 1.0893 1.0943 1.1015 1.1004
irintensity: 0.0739 0.0860 0.5047 1.2834 1.5145 0.7205 2.3742 2.4434 0.8180 1.7059 0.2990 2.8904 7.9315 1.7067 3.2388 2.6419 5.9188 3.2221 2.0057 1.6149 1.5621 1.1327 7.4474 3.5941 9.4535 2.6442 3.5513 5.3925 2.3656 2.8628 19.4601 5.2171 46.8666 26.0127 2.4969 7.9203 77.7432 74.8089 24.5898 0.1967 2.4020 0.0744 4.4956 18.4398 9.8969 3.1768 0.2373 5.6671 0.1782 0.8246 29.9646 117.3935 57.5884 20.6176 10.0157 2.6486 4.5803 13.0971 5.2865 1.4005 16.7131 88.5692 64.8575 4.4424 0.0735 1.3151 4.0094 5.8306 39.1629 60.6792 10.0214 48.7812 38.1623 22.5259 10.7239 1.3393 5.4470 4.1083 17.2684 0.8340 42.6421 8.4677 11.7711 7.4178 5.8616 11.0213 10.5784 67.5943 67.0354 10.3924 112.6155 2.6578 1.1717 35.0461 82.3418 61.4246 34.1657 60.6737 77.4811 161.6221 37.5735 21.6964 27.8875 11.1505 5.9723 2.2683 11.1751 5.2746 0.2678 27.2742 9.2692 16.2143 36.4561 14.4860
temp: 298.150 k
press: 1.00000 atm
elementType: 17 16 7 7 6 6 6 6 6 6 6 6 6 6 6 6 6 6 6 6 6 1 1 1 1 1 1 1 1 1 1 1 1 1 1 1 1 1 1 1
symmnumber: 1
zpe: 843908.6 jmol-1
zpe.correction: 0.321428 hartree
zpe.thermalcorrener: 0.340790 hartree
zpe.thermalcorrenthalpy: 0.341734 hartree
zpe.thermalcorrgfe: 0.269962 hartree
zpe.sumelectzpe: -1625.269220 hartree
zpe.sumelectthermal: -1625.249858 hartree
zpe.sumelectthermalent: -1625.248914 hartree
zpe.sumelectthermalfe: -1625.320686 hartree
dipole: 0.4484 1.1039 -0.2643
dipole: 1.2204
quadrupole: -136.3380 -135.3431 -137.3294
quadrupole: 4.6884 6.9965 0.4299
quadrupole: -0.0012 0.9938 -0.9926 4.6884 6.9965 0.4299
hfenergy: -1625.590648 hartree
pointgroup: C01 [X(C17H19Cl1N2S1)]
dipole: 0.1762422 -0.4352148 0.1003618 debye
polarizability: 312.1752596|-2.0523165|197.3681325|4.4957594|0.0057895|170.4946338 unknown
InChI: InChI=1S/C17H19ClN2S/c18-16-8-4-5-9-17(16)20-12-10-19(11-13-20)14-21-15-6-2-1-3-7-15/h1-9H,10-14H2
charge 0 multiplicity 1
40 atoms
Cl 3.994722 1.65404 1.788438
S  -3.432005 1.480811 -1.228513
N  -0.849268 1.227193 -0.080622
N  1.879962 0.321963 -0.133555
C  -0.068097 1.248141 -1.336919
C  0.020918 1.393997 1.112545
C  1.013408 0.153721 -1.320549
C  1.092811 0.292905 1.126696
C  -2.022753 2.094982 -0.093234
C  3.174663 -0.255367 -0.1514
C  4.236012 0.205887 0.685584
C  3.508739 -1.311567 -1.054628
C  5.522051 -0.360076 0.664808
C  4.801364 -1.871153 -1.105001
C  -4.175034 0.133358 -0.21348
C  5.814733 -1.409956 -0.23604
C  -5.582045 -0.023943 -0.264871
C  -3.385666 -0.750178 0.562658
C  -6.197891 -1.069342 0.460294
C  -4.014988 -1.777091 1.303159
C  -5.41868 -1.945438 1.251961
H  0.421828 2.240876 -1.492547
H  -0.762295 1.065403 -2.177632
H  -0.602948 1.3104 2.022047
H  0.529189 2.387928 1.123407
H  0.512301 -0.843079 -1.327908
H  1.628029 0.243103 -2.233167
H  1.761209 0.438703 1.988061
H  0.59092 -0.697125 1.232545
H  -1.830519 3.117158 -0.491404
H  -2.437369 2.173828 0.925096
H  2.727514 -1.70942 -1.709321
H  6.294482 0.039205 1.328941
H  5.010076 -2.680789 -1.812884
H  6.819187 -1.843706 -0.260169
H  -6.187996 0.670286 -0.857314
H  -2.296785 -0.629964 0.565715
H  -7.286335 -1.188512 0.415043
H  -3.40303 -2.456591 1.907847
H  -5.899712 -2.749796 1.819412
