program: Gaussian 09
title: 000232252
version: EM64L-G09RevD.01
frameworkgroup: C1[X(C16H26N2O)]
method: RPBEPBE
basis: SDD
operation: Freq
keyword: #p
keyword: freq=noraman
keyword: PBEPBE/SDD
title: #p freq=noraman PBEPBE/SDD
converged: YES YES NO NO
title: Mulliken charges:
elementType: O N N C C C C C C C C C C C C C C C C H H H H H H H H H H H H H H H H H H H H H H H H H H
charge: -0.451467 -0.103809 -0.067813 0.001354 -0.402458 -0.365844 -0.369316 -0.342991 -0.323842 -0.761200 -0.592889 -0.392549 0.498810 -0.332508 -0.417957 -0.410627 -0.228808 -0.229768 -0.244220 0.195982 0.178937 0.199585 0.199246 0.186499 0.207497 0.181190 0.233750 0.187677 0.168528 0.196893 0.214011 0.227512 0.221841 0.220123 0.214080 0.231211 0.222581 0.186790 0.184618 0.231900 0.233905 0.341524 0.222908 0.222575 0.226540
chargesum: 0.00000
title: Mulliken charges with hydrogens summed into heavy atoms:
elementType: O N N C C C C C C C C C C C C C C C C
charge: -0.109943 -0.103809 -0.067813 0.197336 -0.023937 0.019901 0.019371 0.078436 0.041580 -0.097837 -0.158686 0.061243 0.498810 0.038900 -0.186057 -0.176721 -0.005900 -0.007192 -0.017680
polarizability: 2.60450571e+02 4.89734391e+00 1.70708810e+02 -9.63441445e+00 1.46834147e+01 1.37115036e+02
1716.lowfreq: -7.9185 -1.2854 -0.0048 -0.0007 -0.0004 8.7817 23.7759 27.9945 30.0151
frequency: 23.2500 26.3157 29.8647 43.0044 51.2936 62.1995 82.8137 97.3256 117.0159 151.7034 176.9798 187.4984 203.1379 236.5043 246.5060 273.2254 280.4722 303.3905 337.0580 349.5322 367.2029 402.9141 404.0032 444.0152 467.0635 485.6859 503.4120 522.6681 583.8173 614.3212 618.2385 704.9957 732.4932 761.9478 786.6870 790.8543 800.2462 828.1676 853.9800 872.9978 883.0424 900.8452 917.7675 945.3456 972.7583 975.8161 989.8511 992.1520 993.1885 1013.6146 1021.2710 1026.8442 1029.9317 1048.9183 1063.2310 1070.4491 1085.9079 1093.3090 1112.1628 1127.9793 1140.4695 1147.4385 1160.9008 1165.9381 1171.5334 1187.1969 1191.3291 1205.4625 1216.6682 1222.9553 1229.2428 1263.1640 1279.8058 1282.0906 1288.3625 1290.2640 1294.8524 1297.9000 1316.1221 1327.0475 1331.6952 1349.7013 1366.0624 1374.7417 1379.3738 1383.0657 1385.6997 1399.2336 1418.2056 1441.0632 1449.6538 1460.0649 1463.7697 1464.2082 1470.9741 1474.4275 1478.6432 1483.0309 1486.0331 1489.0600 1491.7599 1592.9455 1614.4367 2821.2353 2835.9939 2842.7395 2851.9936 2854.6210 2869.0235 2925.7073 2972.7786 2984.4896 2992.3670 2997.4732 3010.4268 3020.9742 3043.8408 3048.4677 3051.6610 3069.7247 3078.1423 3078.4317 3089.3103 3113.5789 3113.9349 3130.4135 3141.8134 3160.9570 3564.7246
redmass: 4.2949 3.2991 4.2581 2.9217 3.1319 2.5504 4.0846 3.0100 2.6183 3.4754 1.4413 1.8450 3.6545 2.0785 3.0577 2.8714 1.1778 2.2308 2.5485 2.5543 2.3224 3.5438 2.8815 3.6151 2.8197 3.4347 2.9462 3.1732 4.3731 2.3286 6.2488 1.8330 2.7129 2.1276 1.1134 1.2269 2.9508 3.1930 1.2483 2.0034 1.3097 1.4746 1.4703 1.7872 5.2396 1.3881 6.0910 2.1390 1.4097 1.8303 2.6964 2.1822 2.8343 2.5963 2.0782 2.0764 2.8725 1.6800 1.7868 2.3287 2.3332 2.4895 1.9376 1.6552 1.0547 1.1196 1.2867 1.4075 1.8324 1.5931 1.6101 1.2544 1.1918 1.1941 1.3451 1.3196 1.3160 1.2307 1.4563 1.2608 1.2529 1.4368 1.3550 1.4377 1.4476 5.5264 1.2605 1.4418 1.4336 2.1803 1.0823 1.0901 1.0842 1.0925 1.0776 1.0743 1.0956 1.8976 1.1816 1.0713 1.0918 6.0547 6.1743 1.0704 1.0723 1.0723 1.0702 1.0770 1.0708 1.0545 1.1067 1.0362 1.0856 1.0590 1.0605 1.0883 1.0897 1.0908 1.0883 1.0969 1.1027 1.0992 1.0991 1.0861 1.0876 1.0908 1.0958 1.1015 1.0664
irintensity: 0.2295 0.2709 0.0153 3.6868 3.5366 3.2015 0.9963 1.2657 3.0756 0.9642 1.0688 1.6142 0.7092 1.2404 3.6336 11.2186 143.4222 2.5242 7.9960 0.1107 4.1838 1.9048 0.1693 7.2784 2.8660 9.6838 12.0354 21.5144 3.9406 3.1861 0.1453 49.6946 11.1724 34.1758 5.1849 1.6165 9.8520 8.5020 0.0451 5.6164 0.6554 4.1882 2.4888 17.2750 59.7570 0.0446 1.4825 33.1961 6.9747 1.4182 12.7426 5.2314 8.1535 4.7586 6.4458 1.8546 34.6346 15.4403 33.5895 6.2679 32.4227 46.5776 26.7602 13.2783 0.2022 0.2050 0.5194 11.9755 0.3162 1.8239 33.8616 18.9763 6.5551 11.9366 3.5229 18.8729 1.8696 12.3570 20.7626 0.2444 20.4509 4.9732 20.4293 3.9794 9.0883 0.8031 15.1763 3.9821 9.4454 6.7176 0.8595 12.7285 2.0322 2.6727 2.5696 10.1712 7.2205 19.1215 1.3396 16.3203 7.9718 1.5539 12.4207 65.3971 74.1860 53.1949 15.5346 28.7093 284.9092 75.7607 57.3451 24.9496 22.0681 26.3690 22.9553 49.6559 37.7243 25.2366 18.7497 38.1272 20.5233 72.6265 36.9374 10.6793 6.8038 11.5779 46.4879 26.2589 2.1777
temp: 298.150 k
press: 1.00000 atm
elementType: 8 7 7 6 6 6 6 6 6 6 6 6 6 6 6 6 6 6 6 1 1 1 1 1 1 1 1 1 1 1 1 1 1 1 1 1 1 1 1 1 1 1 1 1 1
symmnumber: 1
zpe: 1032859.4 jmol-1
zpe.correction: 0.393395 hartree
zpe.thermalcorrener: 0.413527 hartree
zpe.thermalcorrenthalpy: 0.414472 hartree
zpe.thermalcorrgfe: 0.341890 hartree
zpe.sumelectzpe: -808.496866 hartree
zpe.sumelectthermal: -808.476734 hartree
zpe.sumelectthermalent: -808.475789 hartree
zpe.sumelectthermalfe: -808.548372 hartree
dipole: -1.1931 1.7845 0.4469
dipole: 2.1927
quadrupole: -98.2276 -116.4664 -119.4354
quadrupole: -9.0932 -7.1037 1.3015
quadrupole: 13.1489 -5.0899 -8.0589 -9.0932 -7.1037 1.3015
hfenergy: -808.8902612 hartree
pointgroup: C01 [X(C16H26N2O1)]
dipole: 0.4828666 0.6874329 -0.1961427 debye
polarizability: 260.0902586|-7.1069778|170.1942169|-10.4672751|-15.280118|137.989942 unknown
InChI: InChI=1S/C16H26N2O/c1-15-14-17(9-5-13-19)11-12-18(15)10-8-16-6-3-2-4-7-16/h2-4,6-7,15,19H,5,8-14H2,1H3
charge 0 multiplicity 1
45 atoms
O  7.451426 -1.802145 0.196419
N  0.103094 0.46986 -0.15844
N  3.006716 0.339941 0.147088
C  0.845285 1.555561 0.561662
C  2.288402 1.628566 0.011945
C  0.831549 -0.820559 -0.024465
C  2.261896 -0.720873 -0.569489
C  -1.315273 0.340665 0.263809
C  4.424198 0.454226 -0.273703
C  0.173451 2.934346 0.393124
C  -2.160282 -0.533062 -0.705138
C  5.268958 -0.779854 0.106202
C  -3.638721 -0.476879 -0.350276
C  6.763185 -0.539382 -0.125356
C  -4.207719 -1.410786 0.554015
C  -4.473822 0.540957 -0.880928
C  -5.57104 -1.332211 0.918946
C  -5.837572 0.62415 -0.520428
C  -6.391647 -0.312907 0.38295
H  0.919388 1.311854 1.653358
H  2.234706 1.963509 -1.05743
H  2.843759 2.396545 0.583055
H  0.292784 -1.597316 -0.594866
H  0.87725 -1.147965 1.045802
H  2.76795 -1.690699 -0.418991
H  2.220048 -0.516675 -1.670777
H  -1.768869 1.345561 0.277845
H  -1.405534 -0.072809 1.30205
H  4.511185 0.640803 -1.378071
H  4.843017 1.346533 0.234458
H  0.862768 3.730369 0.729709
H  -0.070938 3.11173 -0.670222
H  -0.750511 3.033825 0.987627
H  -1.985258 -0.15578 -1.729952
H  -1.81236 -1.582054 -0.675248
H  5.096963 -1.022171 1.170582
H  4.974028 -1.664222 -0.488261
H  7.124429 0.284735 0.528738
H  6.946567 -0.250848 -1.184491
H  -3.578609 -2.208418 0.969168
H  -4.051488 1.267146 -1.587232
H  8.428036 -1.683841 0.082144
H  -5.993306 -2.065137 1.616154
H  -6.467984 1.413641 -0.945747
H  -7.449709 -0.251929 0.661761
