program: Gaussian 09
title: 000232255
version: EM64L-G09RevD.01
frameworkgroup: C1[X(C17H19ClN2S)]
method: RPBEPBE
basis: SDD
operation: Freq
keyword: #p
keyword: freq=noraman
keyword: PBEPBE/SDD
title: #p freq=noraman PBEPBE/SDD
converged: YES YES NO NO
title: Mulliken charges:
elementType: Cl S N N C C C C C C C C C C C C C C C C C H H H H H H H H H H H H H H H H H H H
charge: -0.076685 0.189456 -0.063246 -0.177970 -0.341015 -0.379279 -0.383280 -0.395116 -0.666188 0.485788 -0.364984 -0.361264 -0.220326 -0.220279 -0.174034 -0.118708 -0.276280 -0.190767 -0.209962 -0.231711 -0.239820 0.194693 0.234502 0.216354 0.203898 0.223303 0.209771 0.218792 0.210616 0.252344 0.273095 0.223978 0.236278 0.249472 0.248567 0.248938 0.287400 0.228729 0.225713 0.229229
chargesum: 0.00000
title: Mulliken charges with hydrogens summed into heavy atoms:
elementType: Cl S N N C C C C C C C C C C C C C C C C C
charge: -0.076685 0.189456 -0.063246 -0.177970 0.088180 0.040973 0.049794 0.034292 -0.140748 0.485788 -0.141007 -0.124987 0.029145 0.028287 -0.174034 -0.118708 -0.027342 0.096634 0.018767 -0.005998 -0.010591
polarizability: 3.44234174e+02 2.81426204e-01 2.06169291e+02 -2.55147435e+00 1.77998901e+01 1.41993974e+02
1716.lowfreq: -9.8933 -5.6513 -4.3610 -0.0028 -0.0022 -0.0014 12.0891 19.6531 32.0397
frequency: 11.8636 19.5398 32.0168 39.6557 59.7251 71.7119 92.2257 122.4940 146.0159 181.7198 211.7848 217.5088 243.4992 264.9946 283.0017 291.3396 336.1040 364.0698 385.4245 394.4370 405.4441 412.0314 424.9068 448.9664 469.2356 481.1475 507.5895 546.8685 611.2368 625.6062 639.9401 670.1924 684.8998 695.9988 698.3445 732.0668 749.3180 759.5064 797.7509 808.7373 847.1305 852.9403 901.9117 916.6095 924.1301 926.8177 942.8085 977.9553 980.1442 983.2342 984.6876 997.4419 1001.4078 1018.0989 1052.8216 1060.8454 1069.3988 1073.9527 1080.7680 1085.9600 1118.3785 1133.1082 1149.2013 1171.0384 1171.6694 1184.6492 1196.6728 1206.7882 1231.5963 1245.7463 1273.8595 1296.3149 1301.1947 1306.4432 1308.4314 1343.8887 1348.7073 1358.8612 1371.9615 1373.3360 1376.4403 1384.5657 1413.7073 1427.4435 1438.6385 1456.2196 1459.0849 1460.6414 1465.4273 1472.2738 1490.7335 1571.8077 1583.2958 1590.5135 1609.8916 2872.4578 2878.1227 2905.4883 2913.9176 2925.8615 3033.7072 3043.9757 3057.9424 3075.4109 3095.5471 3121.8037 3130.0918 3139.9750 3148.9444 3149.3163 3153.7605 3164.3600 3170.1288 3175.8033
redmass: 6.6401 4.0876 3.8482 6.0940 3.3281 6.1540 6.6843 4.3419 7.1747 4.5218 4.6375 3.5271 3.1459 3.3146 3.3308 2.8443 3.7771 4.3711 3.7960 3.6746 3.0160 2.9935 5.3139 4.4595 2.8108 3.4263 2.7559 3.4634 6.4446 6.8995 3.1021 5.7285 5.1915 3.1702 2.3928 4.7649 1.4780 3.2425 1.2901 1.7555 1.5611 1.2475 1.7331 3.5109 1.3784 1.3565 1.3607 2.0997 1.4281 4.0172 4.3050 1.3069 2.5656 3.3338 1.8146 2.0644 2.1896 1.7097 2.7117 2.3022 1.4477 2.4297 2.9254 1.1925 1.7195 1.1239 1.1591 1.1134 1.5002 1.4783 1.2219 1.3715 1.3645 1.3520 1.3244 1.5100 1.4828 1.8382 2.3147 7.7781 1.7403 1.4320 3.6798 2.1129 1.1157 1.0947 1.3567 1.4171 1.1196 1.1131 2.5037 7.3069 6.2814 5.8744 6.2538 1.0705 1.0696 1.0691 1.0678 1.0711 1.0901 1.0903 1.0904 1.0939 1.0893 1.0854 1.0878 1.0933 1.0872 1.0962 1.0877 1.1015 1.0960 1.0961
irintensity: 0.2501 0.1165 0.2916 0.3838 1.1722 1.4863 2.9745 0.1994 1.3581 3.4492 0.4382 7.1590 1.3428 2.0665 6.6889 4.7683 8.6695 4.9987 0.3889 0.4870 0.6945 1.1039 4.6981 0.9555 1.2846 11.2909 22.8059 5.2947 1.7150 0.9788 49.6389 3.7468 41.0905 2.8861 28.5838 11.2168 79.0122 6.9389 3.4052 70.2926 1.6406 0.1489 5.3302 26.4947 1.2092 0.7646 1.9211 31.8693 1.2370 31.2492 0.1296 0.5888 106.9704 21.2596 1.9289 1.6570 15.2776 4.9759 23.1098 1.8195 7.0855 126.0271 33.8620 3.0062 10.9604 3.5778 4.5358 9.2501 135.2021 87.9040 33.6885 43.6472 14.7688 16.2246 8.8843 1.1179 0.5026 16.1738 4.4120 0.2728 37.7869 15.1714 1.2677 6.9919 9.1730 23.1460 33.6363 25.8692 62.6239 7.4722 272.7798 2.5776 1.1181 33.0611 90.8239 50.1987 84.9765 69.5041 100.1304 108.2538 39.5566 18.2115 26.7427 11.2240 20.8010 2.8773 9.1451 0.5449 10.2640 27.8815 9.0395 35.0282 15.0308 4.5067
temp: 298.150 k
press: 1.00000 atm
elementType: 17 16 7 7 6 6 6 6 6 6 6 6 6 6 6 6 6 6 6 6 6 1 1 1 1 1 1 1 1 1 1 1 1 1 1 1 1 1 1 1
symmnumber: 1
zpe: 843768.8 jmol-1
zpe.correction: 0.321375 hartree
zpe.thermalcorrener: 0.340895 hartree
zpe.thermalcorrenthalpy: 0.341840 hartree
zpe.thermalcorrgfe: 0.269665 hartree
zpe.sumelectzpe: -1625.272389 hartree
zpe.sumelectthermal: -1625.252868 hartree
zpe.sumelectthermalent: -1625.251924 hartree
zpe.sumelectthermalfe: -1625.324099 hartree
dipole: 2.8997 -0.1740 1.7285
dipole: 3.3802
quadrupole: -166.9488 -131.6708 -136.6999
quadrupole: 7.7616 1.6499 4.6219
quadrupole: -21.8423 13.4357 8.4066 7.7616 1.6499 4.6219
hfenergy: -1625.5937637 hartree
pointgroup: C01 [X(C17H19Cl1N2S1)]
dipole: -1.1012979 0.2891828 0.6871052 debye
polarizability: 343.8746906|-4.8429629|191.506315|-7.5762388|-32.1849581|157.0164328 unknown
InChI: InChI=1S/C17H19ClN2S/c18-15-6-8-16(9-7-15)20-12-10-19(11-13-20)14-21-17-4-2-1-3-5-17/h1-9H,10-14H2
charge 0 multiplicity 1
40 atoms
Cl 7.526448 -1.042228 -0.628687
S  -3.695481 1.712527 -0.749573
N  -1.095767 1.27901 0.298467
N  1.697944 0.609327 0.009579
C  -0.345001 1.706282 -0.903666
C  -0.206559 1.21818 1.484131
C  0.811641 0.732903 -1.173575
C  0.96343 0.247124 1.236022
C  -2.325286 2.039334 0.532023
C  3.041364 0.188028 -0.150831
C  3.818396 0.62643 -1.268164
C  3.687319 -0.649913 0.809794
C  5.16796 0.253993 -1.416105
C  5.043476 -1.015565 0.67183
C  -4.368678 0.094525 -0.173923
C  5.772457 -0.562708 -0.440547
C  -5.769051 -0.099238 -0.259613
C  -3.530024 -0.943533 0.300062
C  -6.329797 -1.337302 0.129023
C  -4.10476 -2.169118 0.708264
C  -5.501757 -2.373742 0.620235
H  0.059199 2.742173 -0.781172
H  -1.03919 1.700555 -1.763466
H  -0.790616 0.861519 2.352988
H  0.211291 2.224448 1.735365
H  0.384957 -0.262115 -1.43552
H  1.385596 1.090336 -2.0416
H  1.64489 0.312278 2.101462
H  0.567766 -0.794275 1.180107
H  -2.192061 3.143537 0.465632
H  -2.735331 1.782214 1.522424
H  3.382676 1.290002 -2.020693
H  3.135342 -1.048257 1.665019
H  5.744313 0.609054 -2.275721
H  5.516259 -1.660072 1.419055
H  -6.412633 0.712423 -0.615924
H  -2.446806 -0.782928 0.332841
H  -7.413409 -1.484311 0.058766
H  -3.455682 -2.970673 1.079552
H  -5.940232 -3.329429 0.927936
