program: Gaussian 09
title: 000232230
version: EM64L-G09RevD.01
frameworkgroup: C1[X(C14H19ClO2)]
method: RPBEPBE
basis: SDD
operation: Freq
keyword: #p
keyword: freq=noraman
keyword: PBEPBE/SDD
title: #p freq=noraman PBEPBE/SDD
converged: YES YES NO NO
title: Mulliken charges:
elementType: Cl O O C C C C C C C C C C C C C C H H H H H H H H H H H H H H H H H H H
charge: -0.067624 -0.255442 -0.226698 0.375979 -0.422893 -0.423262 -0.388615 -0.445111 -0.102007 -0.738561 -0.724120 0.539771 -0.330244 -0.351997 -0.237260 -0.235982 -0.221883 0.190730 0.237372 0.240441 0.193547 0.244547 0.197303 0.199468 0.211677 0.214233 0.217762 0.221336 0.222015 0.224244 0.228031 0.219868 0.272127 0.255331 0.231868 0.234047
chargesum: 0.00000
title: Mulliken charges with hydrogens summed into heavy atoms:
elementType: Cl O O C C C C C C C C C C C C C C
charge: -0.067624 -0.255442 -0.226698 0.375979 0.005209 0.010727 0.053235 -0.033966 0.112227 -0.077447 -0.051977 0.539771 -0.330244 -0.079870 0.018071 -0.004114 0.012164
polarizability: 2.04607034e+02 -9.51339105e+00 1.74553009e+02 7.89347993e+00 -2.79449021e+00 1.06889974e+02
1716.lowfreq: -0.0004 0.0012 0.0019 5.4253 9.8732 12.0099 27.1011 46.7061 69.8580
frequency: 24.9798 46.6298 69.8326 85.6096 96.4770 125.8000 157.4582 172.8705 200.5343 206.0855 220.2577 245.6036 288.9512 297.5218 306.6699 330.2615 352.5368 385.1193 414.4673 427.4144 437.1622 461.0247 497.5881 529.1135 549.9267 606.1972 633.0709 689.6081 722.2026 726.5947 755.9769 762.4843 788.8182 852.0626 863.9050 887.3938 904.2869 917.1402 925.2057 943.6453 947.9123 960.0472 992.7772 1005.0814 1008.5140 1019.8594 1031.8788 1043.4629 1056.8415 1067.1799 1074.5787 1123.3245 1166.8975 1170.9519 1181.0725 1193.4215 1210.4907 1226.9198 1261.2274 1278.1766 1281.7345 1308.5038 1315.2436 1338.2590 1347.2491 1348.5790 1356.0863 1368.9782 1387.6853 1394.3576 1400.1856 1426.2899 1452.0804 1458.5529 1468.3771 1470.4982 1476.2080 1482.0691 1488.4766 1489.0238 1494.9790 1579.2222 1612.7354 2911.7858 2925.7081 2935.0661 2961.8441 2979.4226 2983.8679 2990.1604 3009.8921 3044.4205 3070.9155 3072.9125 3074.6908 3080.4259 3082.8541 3086.4517 3136.9970 3154.3716 3170.8227 3178.4670
redmass: 5.0023 4.3174 3.8947 2.5053 2.0681 3.5179 2.8993 4.6567 4.7439 2.5825 1.1800 3.7310 2.3157 2.6456 2.5171 2.1913 4.4007 2.5620 5.3472 3.1841 3.5464 3.3754 3.7702 4.1346 4.0470 5.2487 5.0761 5.7623 4.1425 2.9046 1.2785 1.2391 1.2877 2.4444 2.5106 2.2632 3.1129 2.7375 1.8890 6.4947 2.1608 1.4166 1.3401 1.5839 2.9592 3.1708 2.4513 2.1006 3.0016 1.9686 2.2423 1.6401 2.2609 1.0598 1.9072 1.8682 1.6791 1.2886 1.3488 1.4724 1.1656 1.3720 1.1500 1.3176 1.4174 1.5843 2.0119 1.3673 3.1793 1.2378 1.2038 2.1814 1.0788 1.0824 1.2239 1.9974 1.0917 1.0483 1.0485 1.0488 1.0648 6.4206 7.3433 1.0824 1.0686 1.0692 1.0604 1.0364 1.0370 1.0628 1.0992 1.0965 1.0981 1.0987 1.0996 1.0983 1.0966 1.0937 1.0861 1.0915 1.0948 1.0991
irintensity: 0.5419 0.4530 1.3249 0.4638 0.3463 1.6666 1.2129 3.0266 2.2923 0.4621 0.1419 1.0080 0.6848 0.6241 0.1817 0.1183 0.7857 1.7889 7.5569 5.3641 3.5933 4.2012 5.8448 2.7722 2.6403 2.9189 7.8544 16.5088 0.5257 9.4191 4.8793 107.1545 14.1983 1.4871 42.0082 28.8032 17.6908 9.1674 1.4472 23.8472 19.5007 1.0448 0.1108 9.0047 123.6796 28.3876 58.4219 13.6867 14.7462 70.8812 13.2928 5.9072 2.9574 3.5577 10.6370 7.5377 6.5453 3.0699 9.0887 14.5114 2.5339 6.7240 1.3739 1.1971 5.2637 10.1816 28.4735 7.1917 22.7483 19.3755 18.9311 25.3907 4.9754 7.1505 8.8515 9.7099 30.0054 9.0192 7.9193 6.5576 7.8166 13.0761 9.2260 29.1163 22.7403 88.0768 55.4199 33.0877 21.9987 26.1753 27.3976 1.1686 36.6948 17.9879 81.2386 48.1689 34.1111 28.4129 3.0691 14.3689 6.6294 12.4134
temp: 298.150 k
press: 1.00000 atm
elementType: 17 8 8 6 6 6 6 6 6 6 6 6 6 6 6 6 6 1 1 1 1 1 1 1 1 1 1 1 1 1 1 1 1 1 1 1
symmnumber: 1
zpe: 786697.5 jmol-1
zpe.correction: 0.299637 hartree
zpe.thermalcorrener: 0.316582 hartree
zpe.thermalcorrenthalpy: 0.317526 hartree
zpe.thermalcorrgfe: 0.254573 hartree
zpe.sumelectzpe: -1154.072695 hartree
zpe.sumelectthermal: -1154.055750 hartree
zpe.sumelectthermalent: -1154.054806 hartree
zpe.sumelectthermalfe: -1154.117759 hartree
dipole: 1.8478 0.5600 0.6054
dipole: 2.0235
quadrupole: -93.4904 -106.4692 -113.4174
quadrupole: -7.2291 2.6026 -2.4556
quadrupole: 10.9686 -2.0102 -8.9584 -7.2291 2.6026 -2.4556
hfenergy: -1154.372332 hartree
pointgroup: C01 [X(C14H19Cl1O2)]
dipole: 0.7109272 -0.2701877 -0.2352534 debye
polarizability: 205.9417744|7.3287106|173.3713461|-7.2444276|-1.5350729|106.7368966 unknown
InChI: InChI=1S/C14H19ClO2/c1-3-14(4-2)9-16-13(17-10-14)11-7-5-6-8-12(11)15/h5-8,13H,3-4,9-10H2,1-2H3
charge 0 multiplicity 1
36 atoms
Cl -2.508674 2.697274 -0.114425
O  0.342394 -0.646265 -1.135704
O  0.260216 0.661956 0.886319
C  2.50803 0.099505 -0.082322
C  1.733476 -0.216904 -1.394273
C  1.647162 1.142106 0.688126
C  2.670406 -1.177573 0.796267
C  3.86981 0.738732 -0.487165
C  -0.368108 0.40771 -0.41645
C  3.523879 -2.311029 0.187341
C  4.801932 1.123162 0.683909
C  -1.792775 -0.030502 -0.172675
C  -2.842596 0.898341 -0.001526
C  -2.111293 -1.408004 -0.079844
C  -4.16795 0.500536 0.257125
C  -3.431299 -1.833286 0.177659
C  -4.460621 -0.87889 0.348388
H  1.715028 0.686827 -2.045565
H  2.192478 -1.047309 -1.953931
H  2.026464 1.319237 1.707239
H  1.624781 2.107886 0.132958
H  1.658499 -1.560161 1.024042
H  3.110758 -0.877912 1.768498
H  3.667394 1.645712 -1.094988
H  4.405951 0.037457 -1.157831
H  -0.315958 1.347718 -1.01568
H  4.563743 -1.991421 -0.011163
H  3.56988 -3.167808 0.884341
H  3.097665 -2.688007 -0.7604
H  4.330065 1.855866 1.363534
H  5.089684 0.241714 1.284423
H  5.731476 1.581068 0.299347
H  -1.301614 -2.127894 -0.228241
H  -4.951742 1.252633 0.384079
H  -3.657378 -2.90254 0.244731
H  -5.488667 -1.198834 0.549359
