program: Gaussian 09
title: 000232208
version: EM64L-G09RevD.01
frameworkgroup: C1[X(C12H14O3)]
method: RPBEPBE
basis: SDD
operation: Freq
keyword: #pfreq=noraman
keyword: PBEPBE/SDD
title: #p freq=noraman PBEPBE/SDD
converged: YES YES NO NO
title: Mulliken charges:
elementType: O O O C C C C C C C C C C C C H H H H H H H H H H H H H H
charge: -0.272901 -0.271800 -0.263178 0.436450 -0.701343 0.169799 0.173590 0.179851 -0.501149 -0.475392 0.571536 -0.200347 -0.816709 -0.730443 -0.535142 0.238002 0.207194 0.258273 0.260820 0.233427 0.234571 0.227389 0.212359 0.243100 0.220902 0.215420 0.221798 0.244370 0.219552
chargesum: 0.00000
title: Mulliken charges with hydrogens summed into heavy atoms:
elementType: O O O C C C C C C C C C C C C
charge: -0.272901 -0.271800 -0.263178 0.436450 -0.256147 0.169799 0.173590 0.179851 -0.242876 -0.214572 0.571536 0.267650 -0.133861 -0.294121 0.150578
polarizability: 1.93925779e+02 -1.71740983e+01 1.40400882e+02 4.26369200e+00 6.38703820e+00 8.69581159e+01
1716.lowfreq: -87.0579 -0.0003 0.0003 0.0008 3.0831 5.7363 9.5459 33.2296 57.2577
frequency: -87.0364 33.0353 57.1741 66.5519 82.8767 145.8842 176.0160 187.1424 201.1996 238.0314 240.0308 291.2086 352.8336 355.8847 369.9001 395.7762 435.8581 451.5558 474.6036 534.2160 579.0771 655.1418 675.1103 689.5775 714.7194 728.8431 771.4542 811.9178 823.3166 829.7784 846.6964 882.0679 919.4126 939.0899 955.8900 973.4257 979.4010 1016.9437 1031.2735 1049.0093 1063.0005 1112.1373 1118.7042 1143.2042 1154.2478 1162.0727 1184.4629 1241.5538 1279.7559 1297.5550 1304.5660 1362.6351 1390.4911 1401.2860 1409.4947 1428.4202 1444.9290 1455.9430 1463.4787 1467.5001 1469.6045 1476.9110 1480.7960 1490.9770 1617.5622 1631.2283 1670.4577 2956.0536 2962.5269 2974.5728 3006.6811 3038.9620 3042.8939 3064.8583 3083.0087 3083.8964 3087.0594 3122.6164 3163.5343 3190.2195 3190.9083
redmass: 2.3497 3.1044 3.1680 4.5693 3.8489 4.9193 2.6209 1.4203 2.9044 1.6206 2.5769 3.3259 4.7389 5.2814 3.0474 2.3100 2.6308 2.8330 5.4976 3.5148 3.5079 6.5429 6.3289 1.6232 3.2632 5.8133 4.0061 2.6187 3.8902 1.7209 7.7867 1.4523 1.5968 1.3718 4.4824 2.1731 3.9211 1.5248 5.4513 1.5227 1.4619 1.2593 1.0365 2.3085 1.4356 1.8384 1.5839 1.3867 3.5653 3.5438 1.4563 1.3167 1.2359 3.7273 4.3309 1.1888 1.3175 1.1447 1.0975 1.0658 1.2605 1.0698 1.1760 1.8029 7.9880 9.6789 5.0451 1.0331 1.0384 1.0646 1.0534 1.0953 1.1037 1.0958 1.1188 1.0988 1.0629 1.0991 1.0927 1.0919 1.1140
irintensity: 12.8962 0.3302 0.6191 1.2002 3.4386 3.4244 0.4952 0.1432 2.6567 0.0858 0.5971 0.8258 4.1229 2.9019 0.5395 2.0155 2.9022 6.4944 2.9898 9.5068 11.3566 1.1526 0.0120 1.4139 0.4304 6.2464 10.4150 1.8177 17.1564 34.9653 30.9362 24.0544 23.5911 64.4748 25.8870 29.4660 130.2144 15.4564 31.1156 2.9853 4.4087 0.1253 0.0173 12.6723 63.4910 161.1007 47.7229 6.9594 60.0771 48.9175 10.5314 0.7440 24.5670 40.0031 31.7500 2.9695 4.8361 4.5912 47.1802 22.9997 143.4731 23.9659 18.1216 90.2007 11.5738 10.5931 30.1770 71.0547 24.8912 36.0982 140.0901 24.2227 47.2800 10.0597 37.2889 30.9609 12.5451 20.4923 4.0912 2.1681 25.7215
temp: 298.150 k
press: 1.00000 atm
elementType: 8 8 8 6 6 6 6 6 6 6 6 6 6 6 6 1 1 1 1 1 1 1 1 1 1 1 1 1 1
symmnumber: 1
zpe: 608018.1 jmol-1
zpe.correction: 0.231582 hartree
zpe.thermalcorrener: 0.245640 hartree
zpe.thermalcorrenthalpy: 0.246584 hartree
zpe.thermalcorrgfe: 0.190030 hartree
zpe.sumelectzpe: -690.165610 hartree
zpe.sumelectthermal: -690.151552 hartree
zpe.sumelectthermalent: -690.150607 hartree
zpe.sumelectthermalfe: -690.207161 hartree
dipole: 0.8097 1.3266 0.5349
dipole: 1.6437
quadrupole: -84.9669 -79.4680 -89.4934
quadrupole: -3.3421 0.3329 0.2902
quadrupole: -0.3241 5.1747 -4.8506 -3.3421 0.3329 0.2902
hfenergy: -690.3971917 hartree
pointgroup: C01 [X(C12H14O3)]
dipole: 0.308542 0.5329306 0.1974453 debye
polarizability: 194.256601|-16.3274406|140.2868111|6.1387525|4.5030709|86.7413646 unknown
InChI: InChI=1S/C12H14O3/c1-8(2)4-9-5-11-12(15-7-14-11)6-10(9)13-3/h5-6H,1,4,7H2,2-3H3
charge 0 multiplicity 1
29 atoms
O  2.920603 -1.553568 -0.243977
O  3.268751 0.739537 0.404095
O  -1.522389 1.852452 -0.445853
C  -0.635324 -0.35081 -0.754281
C  -2.034051 -0.802891 -1.163141
C  1.706459 -0.814761 -0.330752
C  -0.400371 1.005865 -0.373469
C  1.913006 0.521491 0.047127
C  0.449613 -1.270187 -0.736162
C  0.884604 1.466738 0.036901
C  -2.934585 -1.183037 0.020368
C  3.934412 -0.584498 0.246532
C  -2.486313 -2.368153 0.85656
C  -4.079466 -0.499968 0.282903
C  -1.344591 3.252171 -0.061962
H  -2.524772 -0.000551 -1.740198
H  -1.935048 -1.684995 -1.828309
H  0.296281 -2.310257 -1.03779
H  1.075735 2.500942 0.328739
H  4.305137 -0.916459 1.232528
H  4.738013 -0.491245 -0.504425
H  -3.198446 -2.582357 1.67172
H  -2.39072 -3.280081 0.23317
H  -1.491369 -2.183533 1.304677
H  -4.381149 0.363219 -0.321276
H  -4.737151 -0.777343 1.115622
H  -1.026101 3.343046 0.994941
H  -2.335162 3.713299 -0.18916
H  -0.609907 3.761937 -0.716228
