program: Gaussian 09
title: 000232401
version: EM64L-G09RevD.01
frameworkgroup: C1[X(C24H28Br2O6)]
method: RPBEPBE
basis: SDD
operation: Freq
keyword: #p
keyword: freq=noraman
keyword: PBEPBE/SDD
title: #p freq=noraman PBEPBE/SDD
converged: YES YES NO NO
title: Mulliken charges:
elementType: Br Br O O O O O O C C C C C C C C C C C C C C C C C C C C C C C C H H H H H H H H H H H H H H H H H H H H H H H H H H H H
charge: 0.074421 0.104134 -0.463105 -0.182298 -0.175381 -0.232273 -0.218749 -0.254696 0.288226 -0.122112 -0.167948 -0.276231 0.120023 -0.535510 0.194159 -0.657168 -0.550717 0.134882 -0.675340 -0.810056 0.272828 -0.510543 0.687578 0.112958 -0.788404 -0.558747 -0.482335 -0.414685 0.181887 -0.850917 0.326255 -0.755297 0.259869 0.276271 0.256794 0.225445 0.248832 0.269506 0.280029 0.281865 0.213094 0.260843 0.241545 0.232815 0.236132 0.284779 0.269377 0.218083 0.230460 0.227446 0.268485 0.344130 0.228466 0.250807 0.277458 0.286233 0.257987 0.250283 0.260605 0.247520
chargesum: 0.00000
title: Mulliken charges with hydrogens summed into heavy atoms:
elementType: Br Br O O O O O O C C C C C C C C C C C C C C C C C C C C C C C C
charge: 0.074421 0.104134 -0.118975 -0.182298 -0.175381 -0.232273 -0.218749 -0.254696 0.288226 0.137756 0.108323 -0.019437 0.120023 -0.061233 0.194159 -0.107632 -0.055758 0.134882 -0.172952 -0.056330 0.272828 -0.023083 0.687578 0.112958 -0.062013 -0.079474 -0.204877 0.129536 0.181887 -0.850917 0.326255 0.003111
polarizability: 3.76819843e+02 1.18018468e+01 3.18785383e+02 1.69832592e+00 5.61189415e+00 2.38856396e+02
1716.lowfreq: -6.7205 -3.0501 -0.0002 0.0005 0.0008 0.8591 16.4990 24.2558 31.1088
frequency: 16.4184 24.1103 31.1051 39.0716 49.1374 52.5764 56.2139 61.8053 67.5259 78.3531 88.1693 98.2387 105.0744 117.0825 129.3259 145.6072 163.0765 168.5562 198.1435 206.0935 207.3329 210.7190 214.5418 226.7969 235.8317 243.1129 262.0633 268.0275 272.6407 274.0298 294.3230 301.3447 318.0363 325.3394 328.8368 365.6078 374.2996 380.9656 390.7086 399.9307 414.9224 418.7160 434.4868 447.2028 472.7931 486.1711 492.8017 506.6957 530.7095 564.9540 565.8218 567.4477 589.5753 614.6665 617.9909 633.5849 649.8471 677.5089 683.7063 719.3128 732.7203 755.0490 770.6982 773.4163 781.8278 789.3009 809.1391 840.5166 849.2417 872.2175 894.7786 905.2901 913.6806 916.8225 931.9864 940.7704 946.3489 968.8413 979.3692 987.5132 993.9413 1000.0189 1011.8012 1014.9455 1023.0737 1030.0114 1042.9161 1043.6175 1047.1484 1058.4130 1091.3924 1100.7829 1110.1052 1112.5876 1117.1258 1133.6123 1150.6726 1165.5731 1176.9903 1183.4836 1201.6273 1202.1328 1207.1882 1212.7847 1223.3589 1224.0980 1227.0250 1230.2160 1258.3619 1265.0400 1271.5920 1278.7039 1284.4350 1291.9047 1295.9228 1304.7215 1308.0203 1318.9787 1321.4151 1324.4974 1330.1951 1335.5848 1348.5991 1374.3868 1385.0591 1391.6723 1408.9956 1411.4425 1447.0546 1452.5825 1452.7342 1453.2568 1453.3410 1464.2488 1476.8727 1477.9906 1482.1500 1484.1944 1489.2217 1497.8830 1585.8861 1607.6815 1613.7791 1621.0905 1628.0082 1649.9788 2925.1752 2954.5790 2956.7053 2971.4979 2986.4875 2993.1138 2993.1361 2996.5335 2996.8473 3005.4980 3008.1378 3013.7281 3038.7377 3059.6572 3067.2281 3068.6858 3073.2871 3077.2848 3082.9000 3085.8502 3086.2011 3101.4295 3101.7017 3105.0970 3105.6866 3134.7124 3143.5516 3564.4155
redmass: 7.4575 6.7686 6.2902 17.5636 3.3102 2.0872 3.8331 4.3023 3.4321 3.9359 6.4480 3.8471 6.4814 6.1356 6.4056 3.7447 7.1934 4.4772 3.5502 2.9350 4.5486 4.0392 2.8787 1.4131 2.4867 2.1844 2.1458 2.8684 2.3836 1.5039 3.5524 4.6079 5.6623 3.8830 2.6071 4.4989 3.0466 3.3404 2.7602 4.2721 3.9118 3.6848 3.6616 3.2698 3.5909 4.1044 3.3317 3.7234 5.1762 3.2456 3.2693 3.1166 4.7611 4.1134 3.6367 4.2320 3.6657 4.8391 4.7024 4.3473 3.0899 5.2358 3.9689 2.7873 2.9359 2.9082 2.4149 2.9281 2.6944 2.3290 2.9048 1.8572 2.2551 2.1284 2.2416 2.0553 2.1935 1.9885 3.1297 2.7947 1.8628 2.1609 2.9892 2.2350 2.7139 2.2044 1.7872 1.6577 3.2846 2.8178 2.2451 2.2134 2.1277 2.2667 1.8604 2.1163 2.3171 2.1959 1.8389 1.9855 2.2524 2.0491 2.0865 1.3566 2.4609 1.7003 1.7276 1.6279 1.6458 1.5526 2.0269 1.4447 1.3477 1.4154 1.4364 1.9314 1.4877 1.4743 1.4138 1.4037 1.4571 1.3318 1.4066 1.3672 1.2361 1.1979 1.1051 1.1728 1.0817 1.0772 1.0593 1.0819 1.0586 1.0700 1.0679 1.0711 1.0574 1.0784 1.0650 1.0580 10.6865 8.6701 9.7941 9.0136 9.8563 9.6376 1.0797 1.0668 1.0809 1.0675 1.0597 1.0460 1.0593 1.0528 1.0467 1.0647 1.0383 1.0812 1.0580 1.0987 1.0937 1.0934 1.1016 1.1007 1.0970 1.0978 1.0962 1.0993 1.0945 1.1036 1.1002 1.0918 1.1024 1.0663
irintensity: 0.2291 0.4578 0.3381 0.4512 0.9222 1.4719 1.8334 1.7235 1.4144 2.9291 1.8038 3.4812 0.9540 2.7671 3.2466 0.4664 0.4873 0.3860 2.2170 2.2659 3.0448 10.6866 4.2830 0.6311 0.6171 11.4159 12.0082 12.6862 10.8585 82.6793 0.6980 12.1627 0.1886 5.2013 0.1423 4.3987 0.3136 12.2614 0.6762 2.0849 9.7032 1.1610 10.8870 6.7370 3.4518 3.9235 0.6324 4.1188 7.0817 0.8293 3.5963 7.7781 5.2206 12.2140 1.6053 9.7579 2.4751 25.1616 15.9647 11.6704 9.6039 45.8656 52.7880 26.6548 7.7249 10.4664 3.8261 3.0540 17.7593 23.3774 56.3006 27.7676 2.3727 4.0450 18.5888 8.3927 16.4264 7.1477 1.1184 14.0190 4.1001 2.4940 79.1174 12.1970 3.2223 5.6171 33.3282 12.2297 27.3895 15.5931 3.2288 28.6178 1.6725 4.0686 8.4875 13.1425 32.2571 29.9700 32.8256 45.2893 129.9007 32.3464 33.0508 13.6417 4.6341 27.1506 33.6401 33.2432 17.6185 49.5502 35.1241 61.4759 16.9043 3.0711 7.0876 5.9092 5.0623 0.3523 21.0473 12.2031 30.1648 3.9016 3.3173 0.3822 56.4954 24.7700 52.4711 9.7653 16.0809 7.4465 27.5066 10.9308 11.0423 11.5826 0.6342 13.1107 13.8909 3.9492 30.7007 5.8674 126.8246 162.2535 53.4122 178.9038 107.4577 142.6038 10.8586 14.4403 7.6480 10.2229 7.2433 14.1141 25.1159 42.9371 3.1310 26.2534 0.8363 26.2869 8.8684 12.5366 22.2746 8.1218 3.5636 22.9936 26.9562 23.4169 3.2524 5.2243 9.7109 2.7173 10.5799 2.6764 5.9475 8.9288
temp: 298.150 k
press: 1.00000 atm
elementType: 35 35 8 8 8 8 8 8 6 6 6 6 6 6 6 6 6 6 6 6 6 6 6 6 6 6 6 6 6 6 6 6 1 1 1 1 1 1 1 1 1 1 1 1 1 1 1 1 1 1 1 1 1 1 1 1 1 1 1 1
symmnumber: 1
zpe: 1238856.4 jmol-1
zpe.correction: 0.471855 hartree
zpe.thermalcorrener: 0.504474 hartree
zpe.thermalcorrenthalpy: 0.505418 hartree
zpe.thermalcorrgfe: 0.405896 hartree
zpe.sumelectzpe: -1407.178488 hartree
zpe.sumelectthermal: -1407.145870 hartree
zpe.sumelectthermalent: -1407.144926 hartree
zpe.sumelectthermalfe: -1407.244448 hartree
dipole: -5.7328 -3.7417 2.3244
dipole: 7.2297
quadrupole: -215.5072 -223.1277 -205.5644
quadrupole: -12.3811 -19.0763 -11.8137
quadrupole: -0.7741 -8.3946 9.1687 -12.3811 -19.0763 -11.8137
hfenergy: -1407.6503437 hartree
pointgroup: C01 [X(C24H28Br2O6)]
dipole: 2.3595377 -1.1930761 -1.0485974 debye
polarizability: 378.3152352|-3.7445174|315.3897039|-10.0310936|-10.7439172|240.7566827 unknown
InChI: InChI=1S/C24H28Br2O6/c1-12(27)32-11-19(30)24(31)7-5-16-14-9-15(21(25)26)17-8-13(28)4-6-22(17,2)20(14)18(29)10-23(16,24)3/h8,14,16,20,31H,4-7,9-11H2,1-3H3
charge 0 multiplicity 1
60 atoms
Br -4.171836 -3.998236 0.967889
Br -6.008696 -1.422227 1.742472
O  2.426647 -0.451556 -2.466989
O  0.155442 2.240612 1.448222
O  4.75021 -1.707995 -0.021545
O  6.041037 0.675397 -0.640937
O  -5.521046 2.707132 -1.748373
O  4.746126 1.26503 1.200358
C  1.610696 -0.540768 -0.149153
C  0.32372 -1.262977 -0.668957
C  -0.926302 -0.922805 0.164882
C  -1.163191 0.633643 0.105608
C  2.660991 -1.143162 -1.171639
C  0.760601 -2.741314 -0.812084
C  -2.490151 1.071214 0.837036
C  1.402399 0.994687 -0.227574
C  2.263303 -2.650313 -1.242407
C  0.126433 1.375528 0.533782
C  -2.163645 -1.708851 -0.350237
C  1.993391 -0.926899 1.303486
C  -3.609937 0.253764 0.165647
C  -2.797434 2.595074 0.70074
C  -3.464275 -1.229808 0.289931
C  4.127326 -0.914608 -0.768247
C  -2.4431 0.728203 2.357373
C  -3.329092 3.020169 -0.683602
C  -4.577636 0.800785 -0.636345
C  4.788889 0.350716 -1.344404
C  -4.574466 2.222188 -1.058455
C  -4.377876 -2.048918 0.872767
C  5.87669 1.102692 0.687006
C  7.212576 1.30808 1.354331
H  0.148402 -0.871331 -1.694389
H  -0.757384 -1.219282 1.217785
H  -1.283765 0.87137 -0.977136
H  0.151073 -3.28483 -1.554219
H  0.662921 -3.277715 0.149998
H  1.297681 1.287924 -1.290893
H  2.243746 1.546232 0.226748
H  2.919712 -3.22656 -0.568655
H  2.428091 -3.044504 -2.264201
H  -2.012736 -2.787039 -0.175178
H  -2.248998 -1.558179 -1.448047
H  1.190709 -0.645848 2.007874
H  2.190151 -2.005577 1.420616
H  2.899492 -0.381127 1.615844
H  -1.898819 3.17162 0.972148
H  -3.570521 2.841194 1.455228
H  -3.423529 0.939619 2.820593
H  -2.213937 -0.334012 2.547805
H  -1.678968 1.349903 2.852083
H  2.642996 -1.076337 -3.204265
H  -2.56593 2.851733 -1.472243
H  -3.573389 4.09641 -0.707204
H  -5.368582 0.174635 -1.067009
H  4.083383 1.197818 -1.312756
H  5.092353 0.185278 -2.3911
H  7.957476 1.687585 0.637706
H  7.575225 0.335117 1.733619
H  7.103953 1.997726 2.204269
