program: Gaussian 09
title: 000232205
version: EM64L-G09RevD.01
frameworkgroup: C1[X(C15H22O3)]
method: RPBEPBE
basis: SDD
operation: Freq
keyword: #pfreq=noraman
keyword: PBEPBE/SDD
title: #p freq=noraman PBEPBE/SDD
converged: NO YES NO NO
title: Mulliken charges:
elementType: O O O C C C C C C C C C C C C C C C H H H H H H H H H H H H H H H H H H H H H H
charge: -0.250138 -0.247022 -0.266904 0.371293 -0.419947 -0.421497 -0.387832 -0.446069 -0.056036 -0.739412 -0.723706 0.358887 -0.360906 -0.410066 -0.351749 -0.345823 0.321008 -0.538514 0.186992 0.235642 0.236694 0.188423 0.252891 0.194492 0.197682 0.211365 0.187712 0.223445 0.215594 0.221446 0.222339 0.229331 0.218924 0.257169 0.264944 0.248043 0.237569 0.219489 0.243240 0.221003
chargesum: 0.00000
title: Mulliken charges with hydrogens summed into heavy atoms:
elementType: O O O C C C C C C C C C C C C C C C
charge: -0.250138 -0.247022 -0.266904 0.371293 0.002687 0.003620 0.059551 -0.037021 0.131676 -0.078926 -0.053111 0.358887 -0.103737 -0.145122 -0.103706 -0.108254 0.321008 0.145219
polarizability: 2.43458579e+02 9.68041087e+00 1.53759052e+02 9.64040195e+00 -9.94181516e+00 1.22372664e+02
1716.lowfreq: -26.9472 -8.3327 -5.6019 0.0002 0.0003 0.0006 19.1719 29.6222 63.2270
frequency: 16.9931 28.4133 63.1995 80.3820 82.5589 93.1655 125.8188 167.1182 184.6437 200.2918 207.3392 225.3389 241.3100 243.7527 283.3016 290.8208 315.0614 337.4818 365.7132 383.1172 403.4877 414.3568 449.2123 472.9809 500.5607 505.3030 527.7859 582.7234 611.9172 629.5636 710.0781 722.3507 750.8038 762.5709 784.3206 812.3814 827.5755 870.0681 892.9056 902.0322 914.9420 922.0936 944.4011 949.2416 961.4336 973.3256 988.8809 1001.8276 1002.7007 1015.4973 1032.5401 1052.8594 1065.1581 1073.4133 1112.1214 1112.7786 1156.3943 1165.2648 1174.7896 1178.2919 1191.2829 1214.0878 1223.2143 1231.6048 1261.9817 1280.9416 1298.9677 1306.7334 1316.2077 1334.6454 1346.1894 1348.0577 1357.2157 1366.0940 1381.8923 1390.7790 1394.6370 1415.5871 1436.7437 1448.1439 1455.9673 1463.1731 1466.3925 1471.3713 1473.4814 1481.1907 1485.5042 1489.2316 1491.2123 1505.8651 1587.1054 1627.6482 2843.1269 2915.9011 2927.7477 2957.5637 2960.0086 2980.5522 2982.0416 2985.1950 3008.5346 3044.3418 3046.0128 3072.3364 3072.5921 3075.9007 3080.1541 3082.1007 3082.9720 3122.7164 3151.6899 3152.0230 3171.1811 3175.3655
redmass: 3.3746 4.3521 2.5323 3.4776 2.5080 2.2849 3.6691 4.0996 2.4799 2.6627 2.4915 1.2109 2.1178 1.8310 1.8748 1.8958 2.2099 4.0302 3.3824 3.5292 2.4933 2.9780 3.1888 3.3389 4.3512 3.1864 3.8240 5.0722 4.0638 6.9394 3.3066 2.8252 1.2726 4.3963 1.3108 1.6857 1.4066 2.5683 4.6256 3.5403 2.3954 1.9415 2.3082 4.9709 1.4825 1.3591 8.2438 1.6803 2.4762 1.9116 2.5062 3.1563 2.0763 2.2262 1.2618 1.3200 1.3298 2.2247 1.3918 1.5962 1.9163 1.7844 1.2933 3.2838 1.3607 1.1697 1.2650 1.3816 1.1836 1.3078 1.4788 1.5252 1.5804 1.4014 4.0304 1.2442 1.2042 3.8618 1.1694 1.0808 1.0807 1.0658 1.0502 1.0807 1.0699 1.0482 1.0456 1.0484 1.0610 2.6543 7.5044 6.4661 1.0803 1.0688 1.0690 1.0330 1.0605 1.0392 1.0548 1.0435 1.0986 1.1038 1.0955 1.0975 1.0982 1.0988 1.0958 1.0941 1.0995 1.0992 1.0874 1.0878 1.0960 1.0968
irintensity: 0.9788 0.4460 0.5949 2.3985 0.4262 0.7501 2.4107 2.3364 1.8603 4.7465 0.9860 0.1619 1.5846 4.1616 1.1343 0.3159 0.0584 0.2280 1.9646 4.7550 2.7454 0.0222 0.9348 3.5727 2.6677 4.1041 12.5474 15.1010 9.7398 2.3203 7.5705 1.7237 8.6158 13.8968 14.2812 67.4575 20.6955 9.8964 52.8456 25.2241 1.7062 0.2996 21.3877 28.8085 0.8732 0.8047 57.1224 25.4014 52.0999 30.4016 57.2353 21.6251 99.7899 16.2650 0.3581 5.9424 2.3098 5.1368 107.6525 7.4953 7.1260 38.5120 5.8925 117.7595 15.0080 3.2057 0.7648 20.9753 0.1010 0.4247 21.0720 41.4001 80.4393 2.2365 9.6891 15.3447 17.7359 5.7093 6.9232 6.6551 5.7782 1.9934 13.0262 35.3989 44.0383 9.4737 8.6441 9.3712 2.6734 90.1244 13.0368 66.8522 67.0280 32.3128 95.0840 70.1292 56.3039 34.6073 3.3185 44.7317 29.1018 50.8729 0.5336 23.2493 33.1734 76.9125 51.5742 28.0242 38.1502 28.2000 11.8273 1.7206 12.9347 2.4599
temp: 298.150 k
press: 1.00000 atm
elementType: 8 8 8 6 6 6 6 6 6 6 6 6 6 6 6 6 6 6 1 1 1 1 1 1 1 1 1 1 1 1 1 1 1 1 1 1 1 1 1 1
symmnumber: 1
zpe: 893012.1 jmol-1
zpe.correction: 0.340130 hartree
zpe.thermalcorrener: 0.358633 hartree
zpe.thermalcorrenthalpy: 0.359577 hartree
zpe.thermalcorrgfe: 0.292686 hartree
zpe.sumelectzpe: -809.036525 hartree
zpe.sumelectthermal: -809.018023 hartree
zpe.sumelectthermalent: -809.017079 hartree
zpe.sumelectthermalfe: -809.083970 hartree
dipole: -1.6522 0.9424 -1.6457
dipole: 2.5152
quadrupole: -89.2347 -105.6338 -110.1686
quadrupole: 11.1139 0.0757 -0.0667
quadrupole: 12.4443 -3.9548 -8.4896 11.1139 0.0757 -0.0667
hfenergy: -809.3766558 hartree
pointgroup: C01 [X(C15H22O3)]
dipole: 0.6497103 -0.0364271 -0.7454855 debye
polarizability: 242.584415|15.9555036|141.0540655|-5.3106143|18.276548|135.9518156 unknown
InChI: InChI=1S/C15H22O3/c1-4-15(5-2)10-17-14(18-11-15)12-6-8-13(16-3)9-7-12/h6-9,14H,4-5,10-11H2,1-3H3
charge 0 multiplicity 1
40 atoms
O  0.869355 -0.509722 -1.069888
O  0.942115 0.869644 0.915529
O  -5.318215 -0.25778 0.647117
C  3.102771 0.031986 -0.055772
C  2.290101 -0.226349 -1.35599
C  2.368678 1.185653 0.688393
C  3.118198 -1.232686 0.855051
C  4.527332 0.503232 -0.476167
C  0.270348 0.621564 -0.364764
C  3.833002 -2.471471 0.273408
C  5.51293 0.770754 0.684084
C  -1.191824 0.337026 -0.104446
C  -1.879795 1.042896 0.916028
C  -1.900461 -0.594926 -0.892946
C  -3.249779 0.821987 1.139853
C  -3.278027 -0.828209 -0.678437
C  -3.954296 -0.114053 0.34119
C  -6.087464 -1.22272 -0.140343
H  2.358316 0.663503 -2.023842
H  2.657493 -1.109103 -1.903124
H  2.78117 1.35364 1.696231
H  2.447422 2.127966 0.097639
H  2.069458 -1.490568 1.089884
H  3.592996 -0.960687 1.819114
H  4.429535 1.426781 -1.085244
H  4.967889 -0.258426 -1.150944
H  0.42113 1.532686 -1.001104
H  3.359557 -2.8180 -0.663183
H  4.901486 -2.277679 0.064273
H  3.782822 -3.31053 0.991158
H  5.14616 1.559286 1.366319
H  5.68924 -0.139595 1.283997
H  6.489613 1.104577 0.288764
H  -1.32754 1.748822 1.543774
H  -1.364755 -1.149433 -1.66877
H  -3.793192 1.354544 1.926216
H  -3.801597 -1.560019 -1.300987
H  -6.098008 -0.951022 -1.214164
H  -7.109363 -1.174599 0.263895
H  -5.6878 -2.249066 -0.0230
