program: Gaussian 09
title: 000022083
version: EM64L-G09RevD.01
frameworkgroup: C1[X(C9H21O3PS3)]
method: RPBEPBE
basis: SDD
operation: Freq
keyword: #p
keyword: freq=noraman
keyword: PBEPBE/SDD
title: #p freq=noraman PBEPBE/SDD
converged: YES YES NO NO
title: Mulliken charges:
elementType: S S S P O O O C C C C C C C C C H H H H H H H H H H H H H H H H H H H H H
charge: 0.129902 0.676718 -0.270645 0.604570 -0.467482 -0.473521 -0.630621 0.031494 0.034111 -0.853828 -0.657300 -0.640236 -0.659894 -0.651638 -0.568101 -0.651945 0.220956 0.223693 0.339947 0.311696 0.211876 0.233212 0.225902 0.210630 0.246187 0.222388 0.206321 0.237731 0.230505 0.207515 0.249873 0.226924 0.259382 0.263044 0.272140 0.223277 0.225217
chargesum: 0.00000
title: Mulliken charges with hydrogens summed into heavy atoms:
elementType: S S S P O O O C C C C C C C C C
charge: 0.129902 0.676718 -0.270645 0.604570 -0.467482 -0.473521 -0.630621 0.252449 0.257804 -0.202185 0.013689 0.038969 0.014663 0.032675 -0.045676 0.068690
polarizability: 2.50157416e+02 -9.21145840e-01 1.76033156e+02 1.54276708e+00 -5.51782048e+00 1.83220873e+02
1716.lowfreq: -28.4487 -19.1893 -4.9842 0.0003 0.0008 0.0019 4.8988 19.3668 20.4281
frequency: -28.0387 18.1925 20.2282 27.1782 36.6759 50.1028 52.6686 67.7628 82.7563 98.3009 117.1013 139.6088 159.2258 167.8814 171.8322 182.4550 199.6845 211.8348 217.9481 225.0771 236.8697 253.3355 263.6217 286.3975 297.2936 332.1878 343.1602 356.8928 369.7633 387.7170 417.3444 449.0679 469.5753 475.9337 528.9391 542.4188 662.4035 678.9412 683.7336 773.8942 782.1627 815.1628 820.5134 830.4466 895.1649 901.7686 924.4462 928.4153 933.0914 933.8652 979.9320 1021.0997 1061.1217 1087.1887 1093.5451 1127.8637 1151.2754 1152.7814 1180.7145 1181.4789 1185.6816 1231.1256 1245.7736 1318.1931 1322.2260 1332.2753 1339.4065 1350.2814 1376.5165 1379.7577 1393.7731 1394.6270 1394.9903 1424.5853 1450.4161 1452.3834 1463.4907 1463.7943 1464.4725 1465.8735 1466.3849 1484.5312 1484.8311 1485.2434 2980.5654 2988.0817 2988.5206 2990.4674 2991.2291 2991.8374 2994.8484 3024.2900 3026.3538 3075.6044 3084.8315 3084.8771 3085.7062 3091.8779 3093.7933 3099.5899 3102.0805 3104.4208 3109.2083 3118.8409 3140.1634
redmass: 2.7146 3.6109 3.5100 3.7372 4.8481 4.5608 4.5947 2.6029 5.6148 5.4123 6.3130 8.4344 4.5914 5.7557 1.0380 1.0513 3.0125 1.4113 1.2814 1.3515 2.9889 2.8821 4.5466 3.2990 2.7386 2.6714 4.3001 3.6917 3.7964 3.8236 3.1427 3.1497 3.9151 6.3202 9.5891 6.0205 4.3334 5.2572 7.1282 1.8378 1.6616 2.9699 5.3848 5.4561 2.7787 2.9763 1.2440 1.2868 1.3131 1.2753 1.4266 1.2460 2.8014 1.6247 1.6355 1.0565 2.0777 2.0747 1.9558 1.9658 1.1155 1.2649 1.2370 1.1770 1.4434 1.4850 1.2025 1.0710 1.2470 1.2517 1.1855 1.2153 1.2149 1.1081 1.0497 1.0493 1.0473 1.0466 1.0484 1.0373 1.0479 1.0506 1.0507 1.0526 1.0354 1.0355 1.0394 1.0756 1.0778 1.0471 1.0388 1.0559 1.0540 1.0990 1.1002 1.0991 1.0988 1.0987 1.0989 1.1013 1.1009 1.1010 1.1008 1.1085 1.1126
irintensity: 0.3906 1.6428 0.5455 0.9333 4.8707 0.2221 2.8595 2.0415 2.1571 2.6665 0.8098 3.6314 4.8021 5.5542 0.1236 0.1681 8.1192 3.4246 0.4881 2.2671 1.8487 8.6045 2.5850 2.8683 3.9671 2.5563 2.3105 14.4342 0.2776 8.7595 12.0812 34.5221 26.8354 1.3021 58.2564 17.2347 35.5938 58.7622 25.0236 13.5251 6.5739 61.5068 316.7062 181.5829 82.2704 56.2205 3.9609 4.4383 1.3617 1.4081 23.0583 0.5455 3.5231 104.1973 60.1218 1.2625 11.6169 7.4279 15.8820 24.2565 44.0624 1.4483 2.5465 22.9620 9.4373 6.7574 11.4837 11.1352 23.3391 34.0650 29.5648 26.4530 28.2326 2.1791 4.9632 6.2933 1.5204 9.3855 3.5382 18.1918 8.2928 17.9072 12.2239 11.7651 31.4681 12.8166 12.6838 9.1065 10.5703 18.8705 25.4218 5.7890 7.2711 4.7960 14.7809 2.4973 8.3846 37.7591 38.6505 10.7272 15.2918 30.3736 27.7689 16.2448 5.2049
temp: 298.150 k
press: 1.00000 atm
elementType: 16 16 16 15 8 8 8 6 6 6 6 6 6 6 6 6 1 1 1 1 1 1 1 1 1 1 1 1 1 1 1 1 1 1 1 1 1
symmnumber: 1
zpe: 767977.8 jmol-1
zpe.correction: 0.292507 hartree
zpe.thermalcorrener: 0.315851 hartree
zpe.thermalcorrenthalpy: 0.316796 hartree
zpe.thermalcorrgfe: 0.236545 hartree
zpe.sumelectzpe: -2115.237792 hartree
zpe.sumelectthermal: -2115.214448 hartree
zpe.sumelectthermalent: -2115.213504 hartree
zpe.sumelectthermalfe: -2115.293755 hartree
dipole: -2.6845 -0.6807 3.3588
dipole: 4.3533
quadrupole: -125.1822 -119.3977 -137.4980
quadrupole: -6.3968 9.5084 2.3515
quadrupole: 2.1771 7.9616 -10.1387 -6.3968 9.5084 2.3515
hfenergy: -2115.5302997 hartree
pointgroup: C01 [X(C9H21O3P1S3)]
dipole: -0.9557759 0.8237181 -1.1582117 debye
polarizability: 236.5945307|-26.934712|188.9174298|-11.4667429|-1.4010071|183.8994849 unknown
InChI: InChI=1S/C6H14O2PS.C3H7OS2/c1-5(2)7-9(10)8-6(3)4;1-2-6(4)3-5/h5-6H,1-4H3;2-3H2,1H3
charge 0 multiplicity 1
37 atoms
S  0.887823 0.656218 2.090662
S  2.723187 -0.926714 0.022841
S  0.046955 1.298323 -1.479957
P  -0.701678 0.862846 0.415199
O  -1.700326 -0.545786 0.528609
O  -1.708517 2.017173 1.193271
O  3.681436 -1.818444 1.066018
C  -1.214243 -1.859564 -0.054266
C  -2.799008 2.722932 0.40951
C  2.377165 0.753602 0.990804
C  -2.3652 -2.376502 -0.922418
C  -0.844051 -2.779272 1.113867
C  -2.964158 4.062822 1.12934
C  -4.064414 1.857312 0.399108
C  4.017618 -0.118474 -1.224276
C  4.963354 -1.221815 -1.690757
H  -0.326729 -1.6476 -0.684801
H  -2.415531 2.876576 -0.619874
H  3.259923 0.873936 1.639001
H  2.265914 1.552714 0.24095
H  -2.093608 -3.354635 -1.360286
H  -2.58597 -1.673329 -1.743257
H  -3.275739 -2.509863 -0.312225
H  -0.505691 -3.758198 0.726809
H  -0.029236 -2.348754 1.720073
H  -1.7205 -2.943291 1.764812
H  -3.749862 4.659852 0.631276
H  -2.021688 4.634771 1.116221
H  -3.262138 3.898753 2.17947
H  -4.860426 2.368001 -0.174324
H  -3.872711 0.873338 -0.061279
H  -4.424791 1.692082 1.429243
H  4.53579 0.658724 -0.636451
H  3.400291 0.337946 -2.015055
H  5.355373 -1.769147 -0.813177
H  4.459156 -1.9450 -2.355721
H  5.817333 -0.784732 -2.239861
