program: Gaussian 09
title: 000232159
version: EM64L-G09RevD.01
frameworkgroup: C1[X(C3H6O2S2)]
method: RPBEPBE
basis: SDD
operation: Freq
keyword: #pfreq=noraman
keyword: PBEPBE/SDD
title: #p freq=noraman PBEPBE/SDD
converged: NO YES NO NO
title: Mulliken charges:
elementType: S S O O C C C H H H H H H
charge: 0.024293 0.729803 -0.403039 -0.497207 -0.047343 -0.685842 -0.642134 0.250258 0.274401 0.290481 0.250078 0.246940 0.209310
chargesum: 0.00000
title: Mulliken charges with hydrogens summed into heavy atoms:
elementType: S S O O C C C
charge: 0.024293 0.729803 -0.403039 -0.497207 0.202915 -0.120960 0.064194
polarizability: 9.64534396e+01 8.12668777e+00 7.94483453e+01 -6.95091878e+00 4.98061744e+00 5.85548381e+01
1716.lowfreq: -17.4322 0.0033 0.0035 0.0043 3.1822 9.5268 99.0432 145.6773 191.2425
frequency: 99.0286 145.6629 191.2285 213.2129 253.1477 298.0140 323.6850 380.1190 427.9427 484.1490 587.9623 675.2519 773.9733 852.5413 886.3186 909.9832 999.0492 1059.8100 1110.1626 1169.9047 1230.6122 1273.5452 1311.8171 1394.8833 1420.8687 1463.4107 1472.9172 2995.9126 3006.1784 3029.9922 3092.3573 3111.1331 3113.2245
redmass: 5.1540 3.8704 2.3304 1.6129 7.9269 3.8333 8.8985 3.5348 5.0008 11.6992 4.7932 4.0043 3.9326 1.9418 2.1890 15.5670 1.4289 1.4386 1.4965 1.7782 1.3554 1.1832 1.4058 1.2050 1.0967 1.0458 1.0482 1.0383 1.0810 1.0596 1.0981 1.1070 1.1014
irintensity: 4.2970 1.6635 0.7227 0.6442 4.6157 3.4553 21.4399 6.9869 12.6684 49.5465 7.8622 6.1881 13.4891 3.5552 17.1933 81.8294 10.5968 6.7291 6.2428 25.3910 3.3014 6.6461 22.7105 31.6642 4.9680 13.8538 5.0271 14.0995 2.8426 14.2682 13.0916 11.5504 9.3433
temp: 298.150 k
press: 1.00000 atm
elementType: 16 16 8 8 6 6 6 1 1 1 1 1 1
symmnumber: 1
zpe: 237805.6 jmol-1
zpe.correction: 0.090575 hartree
zpe.thermalcorrener: 0.098777 hartree
zpe.thermalcorrenthalpy: 0.099721 hartree
zpe.thermalcorrgfe: 0.057604 hartree
zpe.sumelectzpe: -1063.840441 hartree
zpe.sumelectthermal: -1063.832239 hartree
zpe.sumelectthermalent: -1063.831295 hartree
zpe.sumelectthermalfe: -1063.873412 hartree
dipole: 3.3573 0.0799 -1.1287
dipole: 3.5429
quadrupole: -52.3714 -58.9800 -59.2979
quadrupole: -3.7102 2.9004 -1.3540
quadrupole: 4.5117 -2.0969 -2.4148 -3.7102 2.9004 -1.3540
hfenergy: -1063.9310159 hartree
pointgroup: C01 [X(C3H6O2S2)]
dipole: 0.9836142 0.9174769 -0.3655647 debye
dipolederiv: -0.1707175 -0.0349081 0.0031363 -0.0311035 -0.4563652 -0.0752863 -0.0904586 -0.164411 -0.175397 0.8784912 0.1007087 -0.1262658 0.4126023 1.1515765 0.1112193 -0.2881061 -0.1448491 0.5328446 -0.7450114 0.033282 0.1406568 0.0446467 -0.4421251 0.0005391 -0.1155868 -0.0306031 -0.4687252 -0.395784 0.0291575 -0.0474563 -0.3925069 -0.7069603 -0.0643114 0.2727268 0.324486 -0.2516851 0.4435804 -0.1010577 0.0365252 -0.1714276 0.329002 0.0072992 0.4387063 0.0069652 0.1995897 0.0602798 0.0743581 -0.0566711 0.1026968 -0.0118782 -0.0802793 -0.1466224 -0.1863026 0.0956425 -0.0349322 0.0685731 -0.0467585 0.0889179 -0.0939578 0.1205726 -0.080573 0.100443 -0.0689459 -0.0555567 -0.0394444 0.0855823 0.0009497 0.0811851 0.0304912 0.0108192 0.0388566 -0.006554 -0.0158445 -0.0772696 -0.0467692 -0.0686095 0.0940326 -0.0202494 -0.0334438 0.0073121 0.0539259 0.000039 0.0074317 0.0277356 0.0342207 -0.0178575 0.0637117 0.0590528 0.1365441 -0.0440506 0.0255783 -0.034165 0.1077831 0.0047042 0.071295 -0.0084915 0.0411355 0.002193 0.0136304 0.098923 0.0131904 -0.0030599 0.066354 -0.0576225 -0.0538606 0.0246493 -0.0759381 0.0425122 -0.0890453 -0.0398567 -0.0744385 -0.0914448 0.0596755 -0.0313545 -0.0922992 -0.0146959 0.0772123 unknown
polarizability: 79.7792314|14.487986|89.9033429|-8.4341986|7.6555631|64.7740487 unknown
InChI: InChI=1S/C3H6O2S2/c1-3(2-6)5-7-4/h3H,2H2,1H3
charge 0 multiplicity 1
13 atoms
S  -0.655237 1.331054 1.132409
S  -1.345467 -0.569515 -0.298848
O  0.226377 -0.357981 -1.28398
O  -1.27906 -1.891776 0.630403
C  1.3637 0.204872 -0.498185
C  0.900156 1.558437 0.083695
C  1.929959 -0.792093 0.52203
H  2.105863 0.401647 -1.297227
H  1.668328 1.97166 0.760884
H  0.678995 2.271781 -0.725033
H  1.236773 -0.951792 1.3646
H  2.113913 -1.763159 0.032858
H  2.8900 -0.418036 0.923194
