program: Gaussian 09
title: 000232175
version: EM64L-G09RevD.01
frameworkgroup: C1[X(C11H16N6O)]
method: RPBEPBE
basis: SDD
operation: Freq
keyword: #p
keyword: freq=noraman
keyword: PBEPBE/SDD
title: #p freq=noraman PBEPBE/SDD
converged: YES YES NO NO
title: Mulliken charges:
elementType: O N N N N N N C C C C C C C C C C C H H H H H H H H H H H H H H H H
charge: -0.453281 -0.205197 -0.088009 -0.046494 -0.070683 -0.373242 -0.502051 -0.017124 -0.139572 -0.460966 -0.445344 -0.394564 -0.420884 0.119777 -0.224965 -0.109286 0.143354 -0.374643 0.247549 0.250832 0.209023 0.241574 0.209894 0.232745 0.215674 0.209136 0.223888 0.186209 0.309051 0.335339 0.239934 0.347861 0.302281 0.302182
chargesum: 0.00000
title: Mulliken charges with hydrogens summed into heavy atoms:
elementType: O N N N N N N C C C C C C C C C C C
charge: -0.117942 -0.205197 -0.088009 -0.046494 -0.070683 -0.025381 0.102413 0.230425 0.111260 -0.010369 -0.002705 0.030246 -0.010786 0.119777 0.084086 -0.109286 0.143354 -0.134709
polarizability: 2.32712094e+02 -2.38882252e+00 1.53553580e+02 1.14400100e+00 -8.75591823e+00 1.03545448e+02
1716.lowfreq: -7.6334 -0.0004 -0.0003 0.0004 7.3394 8.8924 19.5764 43.4043 79.4665
frequency: 18.3423 43.2876 79.4288 98.7692 136.2503 156.1261 162.9539 168.8156 204.0248 214.6532 236.1708 264.6088 267.5418 288.1853 305.1005 361.0630 380.7372 390.4277 473.6164 492.2465 508.7790 566.3421 582.1130 602.8768 642.3596 645.1184 664.3355 669.1045 727.1743 749.5152 789.5496 794.9459 805.8748 814.7303 848.0930 861.9969 863.6401 882.2781 902.6790 924.3370 940.1385 968.0742 1000.6478 1037.1459 1060.3006 1082.1836 1097.8811 1104.8474 1116.8317 1138.0498 1183.4663 1195.1313 1200.2662 1209.1128 1242.9145 1250.9149 1271.7929 1288.9837 1298.9758 1306.7379 1311.8143 1318.8138 1333.4329 1340.0213 1341.2929 1349.7889 1359.7589 1371.4454 1372.6182 1394.7194 1413.3289 1434.9277 1457.9037 1468.7462 1470.4460 1476.1337 1485.5343 1537.6413 1592.9676 1682.6799 2946.2328 2977.6715 2982.4039 2991.2135 2999.9870 3038.0087 3044.3098 3054.9379 3056.6256 3060.5041 3161.2321 3253.8612 3384.4317 3495.9735 3561.6654 3569.6572
redmass: 4.3072 5.1092 4.5106 4.3773 2.9603 1.4488 2.8889 4.6522 3.6902 4.5660 4.6841 1.1283 4.5416 4.9632 1.9359 4.7515 2.4726 3.9870 2.1534 5.8102 5.2154 3.4273 1.1538 3.9073 5.7881 5.8433 3.1844 7.1366 3.2229 2.5965 4.2948 9.1441 2.4701 1.8881 2.5207 2.5763 2.0437 2.2557 1.5952 1.4297 2.7078 2.8418 3.1071 1.5190 1.7138 1.9966 1.9714 1.8543 3.0516 2.4442 1.9673 1.8072 2.0692 1.6939 1.5617 1.3200 2.3306 1.1506 5.7973 1.5033 4.3625 1.5230 1.4241 1.4432 1.4774 1.4414 5.2224 1.6197 1.2392 1.4285 2.9894 2.0001 1.0889 1.1143 3.6477 1.1034 1.0925 8.2548 6.7579 1.0632 1.0700 1.0644 1.0649 1.0628 1.0803 1.0908 1.0991 1.0910 1.0988 1.1001 1.0919 1.0993 1.0427 1.0984 1.0656 1.0791
irintensity: 0.5438 1.0916 3.0541 0.2771 2.8577 18.9574 7.5944 0.6228 2.9188 19.9080 8.1197 113.1085 0.7691 1.9671 11.1322 18.0281 0.4441 2.3292 0.1223 9.7154 5.3372 11.7820 164.0036 6.8842 7.4968 11.4889 25.4024 8.6528 28.9507 26.8222 38.8114 5.0703 99.2740 14.1831 11.0601 20.7910 19.2164 18.3259 7.8059 10.3341 25.8379 18.2875 0.5702 2.0511 2.9593 61.3869 3.4590 14.3534 0.3369 8.0786 5.2408 37.6335 58.0589 33.9642 2.7276 3.3515 26.6109 0.1334 61.8974 6.0908 31.2470 3.1408 15.6477 3.5736 6.6130 3.1287 79.9713 7.1468 28.2144 3.6241 79.3056 51.7689 9.9103 13.0052 20.0005 6.2324 18.1793 58.5469 481.2107 31.7742 36.8059 22.8132 19.7005 12.3693 26.7898 60.5196 45.2665 16.5621 23.5048 39.7863 19.3030 13.9052 0.1746 1.3029 3.6041 92.3634
temp: 298.150 k
press: 1.00000 atm
elementType: 8 7 7 7 7 7 7 6 6 6 6 6 6 6 6 6 6 6 1 1 1 1 1 1 1 1 1 1 1 1 1 1 1 1
symmnumber: 1
zpe: 727780.0 jmol-1
zpe.correction: 0.277197 hartree
zpe.thermalcorrener: 0.293378 hartree
zpe.thermalcorrenthalpy: 0.294322 hartree
zpe.thermalcorrgfe: 0.232915 hartree
zpe.sumelectzpe: -831.136544 hartree
zpe.sumelectthermal: -831.120363 hartree
zpe.sumelectthermalent: -831.119418 hartree
zpe.sumelectthermalfe: -831.180826 hartree
dipole: 4.6747 1.5023 0.5717
dipole: 4.9434
quadrupole: -92.6938 -114.9813 -103.8413
quadrupole: -1.2401 3.2297 -0.8305
quadrupole: 11.1450 -11.1425 -0.0025 -1.2401 3.2297 -0.8305
hfenergy: -831.4137405 hartree
pointgroup: C01 [X(C11H16N6O1)]
dipole: 1.8427332 0.3329238 0.5254034 debye
polarizability: 232.6920589|-0.1574769|140.2746485|-3.3921715|23.7106663|116.8444147 unknown
InChI: InChI=1S/C11H16N6O/c12-16-10-9-11(14-5-13-10)17(6-15-9)7-3-1-2-4-8(7)18/h5-8,16,18H,1-4,12H2
charge 0 multiplicity 1
34 atoms
O  2.966616 -1.330202 -1.651535
N  0.445522 -0.362806 -0.311091
N  -1.267536 -1.743223 -0.981946
N  -0.88882 1.432654 0.775818
N  -3.307155 0.987743 0.657047
N  -4.207385 -0.948944 -0.381935
N  -5.551895 -0.582492 -0.11516
C  1.790779 0.186614 -0.034174
C  2.737695 0.079897 -1.25774
C  2.432097 -0.437895 1.230232
C  4.071895 0.794894 -0.946461
C  3.775952 0.265491 1.545672
C  4.742174 0.234164 0.335963
C  -0.742186 0.24923 0.106882
C  0.068819 -1.557188 -0.952999
C  -1.784836 -0.615499 -0.318534
C  -3.114913 -0.19607 -0.014939
C  -2.202461 1.722057 1.007459
H  1.620444 1.263676 0.166773
H  2.249536 0.521045 -2.143904
H  2.588477 -1.524144 1.072484
H  1.734468 -0.333209 2.080237
H  3.874382 1.876587 -0.811908
H  4.745038 0.691622 -1.817507
H  4.24991 -0.206677 2.426491
H  3.572596 1.320614 1.82026
H  5.655403 0.816652 0.558542
H  5.089635 -0.808658 0.166466
H  0.81114 -2.214349 -1.396663
H  3.671717 -1.7142 -1.071477
H  -2.405963 2.656043 1.540108
H  -4.063147 -1.824847 -0.885167
H  -5.772127 0.317047 -0.567779
H  -5.704571 -0.506229 0.901286
