program: Gaussian 09
title: 000232153
version: EM64L-G09RevD.01
frameworkgroup: C1[X(C4H9NO2S)]
method: RPBEPBE
basis: SDD
operation: Freq
keyword: #p
keyword: freq=noraman
keyword: PBEPBE/SDD
title: #p freq=noraman PBEPBE/SDD
converged: YES YES NO NO
title: Mulliken charges:
elementType: S O O N C C C C H H H H H H H H H
charge: 0.997303 -0.552912 -0.552938 -0.286488 -0.412376 -0.412187 -0.437819 -0.737075 0.246473 0.281310 0.281341 0.246495 0.239812 0.235705 0.285252 0.285277 0.292826
chargesum: 0.00000
title: Mulliken charges with hydrogens summed into heavy atoms:
elementType: S O O N C C C C
charge: 0.997303 -0.552912 -0.552938 -0.286488 0.115407 0.115650 0.037698 0.126281
polarizability: 1.00297760e+02 -9.39011261e-03 7.84523621e+01 4.38449214e-01 1.63265283e-02 6.77846558e+01
1716.lowfreq: -155.5807 -0.0032 -0.0029 -0.0020 7.9105 15.4775 22.4312 65.3953 71.2548
frequency: -155.5750 64.7341 71.2497 174.8022 182.3931 239.2976 248.3195 305.3692 357.5019 395.9820 400.5453 589.2503 763.5772 787.2828 800.8856 825.6634 859.5705 882.4614 930.6861 961.1489 974.0378 998.1264 1004.1147 1092.5656 1124.0620 1189.5396 1199.5364 1247.5407 1275.4670 1281.7245 1297.3281 1419.7366 1423.8768 1472.5999 1473.4130 1488.9320 3001.5837 3006.2624 3032.1111 3049.4107 3081.6990 3082.8572 3124.7498 3188.5723 3189.2305
redmass: 1.0224 3.5364 2.1812 3.2317 5.1340 4.3044 5.3325 7.1625 4.5034 3.9014 8.7741 8.9097 3.5982 1.4830 5.0225 1.1400 4.1230 2.8928 4.2129 1.2840 4.2573 1.9838 3.7328 1.0869 1.6950 1.2249 1.1035 1.3523 1.1355 1.3053 1.3563 1.0551 1.0537 1.0826 1.0723 1.1005 1.0596 1.0629 1.0240 1.0608 1.1061 1.1033 1.1083 1.1078 1.1074
irintensity: 0.0340 5.4483 1.7439 10.0228 0.6715 0.1890 18.1963 12.2586 0.0391 14.1161 40.9108 41.5956 11.0548 2.9067 55.2501 0.0003 24.3998 36.2533 0.5499 32.7515 5.2139 64.0688 0.6497 0.3472 2.6333 10.2315 0.2434 14.8993 5.9016 4.1681 6.7184 16.9103 14.0506 2.6196 16.3605 3.3487 21.7624 10.8059 0.1755 45.1481 5.5410 21.9989 24.1077 0.0715 0.1071
temp: 298.150 k
press: 1.00000 atm
elementType: 16 8 8 7 6 6 6 6 1 1 1 1 1 1 1 1 1
symmnumber: 1
zpe: 344284.0 jmol-1
zpe.correction: 0.131131 hartree
zpe.thermalcorrener: 0.140103 hartree
zpe.thermalcorrenthalpy: 0.141047 hartree
zpe.thermalcorrgfe: 0.096810 hartree
zpe.sumelectzpe: -760.221520 hartree
zpe.sumelectthermal: -760.212548 hartree
zpe.sumelectthermalent: -760.211604 hartree
zpe.sumelectthermalfe: -760.255841 hartree
dipole: -1.5653 -0.0175 3.5969
dipole: 3.9228
quadrupole: -46.8929 -61.0522 -59.0816
quadrupole: -0.0307 7.7791 -0.0219
quadrupole: 8.7827 -5.3767 -3.4060 -0.0307 7.7791 -0.0219
hfenergy: -760.352651 hartree
pointgroup: C01 [X(C4H9N1O2S1)]
dipole: 0.5929584 -0.4147681 -1.3632053 debye
dipolederiv: 1.4276897 0.0578981 -0.0108561 0.0663252 1.1573531 -0.0187087 0.0093045 -0.0142262 1.1097423 -0.7032766 0.0682814 0.0368893 0.1199956 -0.6650776 -0.0901339 0.0138237 -0.0081051 -0.4909435 -0.630707 -0.0556357 0.022233 -0.096904 -0.5850489 0.1636156 0.0724879 0.0876913 -0.6442264 -0.4839354 0.006186 0.065323 -0.0662714 -0.3907829 0.0471731 -0.1170404 0.0063358 -0.3122596 0.2195271 -0.1306709 -0.0655718 -0.1269993 0.152811 0.0339134 0.1194609 0.0428731 0.0616167 0.1076722 0.0587034 -0.1072487 0.1791888 0.1654666 -0.1194632 0.01959 -0.0590871 0.1613055 0.0239918 0.0091816 -0.0445311 0.0280157 -0.0595356 0.0737226 0.0027396 0.0844985 0.1157463 -0.1725375 -0.038215 -0.0549213 -0.0180367 -0.1158802 -0.0280236 -0.004557 -0.0166807 -0.1397424 -0.0515628 0.0656122 0.0261835 0.0674244 -0.0926042 -0.0542866 0.0048309 -0.0840884 0.0736578 0.1170542 -0.0207043 0.0617817 -0.0068038 0.0737959 0.0129418 -0.0416723 0.0315494 -0.0066522 0.0942192 0.0796362 0.0322318 0.0041321 0.0375622 -0.0189397 -0.0195355 -0.0720042 0.0527077 -0.0056698 -0.0379368 0.0230307 -0.0579529 0.0197294 0.0977209 -0.0006508 0.1173422 -0.0844588 0.0089735 -0.0363318 -0.0487712 -0.0657008 0.0418238 -0.0700448 -0.122635 -0.086656 -0.0643731 -0.0929643 -0.0111779 0.0843153 0.0062956 0.0990338 -0.0205959 0.1282187 -0.0107246 0.0063083 0.0666918 -0.0540736 -0.0202795 -0.0637701 0.0257236 0.0410712 -0.0355067 0.0299768 0.0488348 0.0241299 0.0378525 -0.0435888 0.0331129 0.0258239 -0.0191171 -0.0641156 -0.0159899 0.0914311 0.0507042 0.0013945 0.0437801 -0.0020513 0.1098062 -0.0308451 0.0352571 -0.0327051 0.0213054 unknown
polarizability: 99.3868882|4.1344328|77.8080234|-1.4524457|-3.9555751|69.3398662 unknown
InChI: InChI=1S/C4H9NO2S/c1-8(6,7)5-3-2-4-5/h2-4H2,1H3
charge 0 multiplicity 1
17 atoms
S  -0.988544 -0.400375 0.465696
O  -1.407674 1.162869 0.701661
O  -0.826957 -1.41771 1.736163
N  0.673609 -0.439221 -0.567979
C  1.811685 -1.047534 0.265724
C  1.366779 0.931187 -0.520127
C  2.632459 0.274314 0.119063
C  -2.191973 -1.178599 -0.798967
H  2.214674 -1.951158 -0.219359
H  1.499456 -1.294258 1.298403
H  0.836491 1.655768 0.126834
H  1.471161 1.354584 -1.532084
H  2.97123 0.725826 1.063983
H  3.482393 0.189542 -0.575208
H  -2.587098 -2.082224 -0.316575
H  -2.962364 -0.418503 -0.983985
H  -1.582522 -1.396707 -1.685544
