program: Gaussian 09
title: 000232170
version: EM64L-G09RevD.01
frameworkgroup: C1[X(C12H6Cl4O2S)]
method: RPBEPBE
basis: SDD
operation: Freq
keyword: #p
keyword: freq=noraman
keyword: PBEPBE/SDD
title: #p freq=noraman PBEPBE/SDD
converged: YES YES NO NO
title: Mulliken charges:
elementType: Cl Cl Cl Cl S O O C C C C C C C C C C C C H H H H H H
charge: 0.002635 0.002634 0.010024 0.010022 0.176108 -0.400201 -0.400198 -0.342701 -0.342711 0.351222 0.351203 -0.160123 -0.160082 -0.306528 -0.306529 -0.106519 -0.106531 -0.054321 -0.054327 0.267750 0.267749 0.290349 0.290350 0.360363 0.360363
chargesum: 0.00000
title: Mulliken charges with hydrogens summed into heavy atoms:
elementType: Cl Cl Cl Cl S O O C C C C C C C C C C C C
charge: 0.002635 0.002634 0.010024 0.010022 0.176108 -0.039838 -0.039835 -0.342701 -0.342711 0.351222 0.351203 0.107628 0.107667 -0.016179 -0.016180 -0.106519 -0.106531 -0.054321 -0.054327
polarizability: 2.48009986e+02 3.70036104e+00 1.94363978e+02 1.61257675e-04 -9.14595587e-03 1.50498459e+02
1716.lowfreq: -4.9567 -3.8104 -0.0020 -0.0013 -0.0010 5.5844 9.7715 13.8024 22.9622
frequency: 6.7767 13.6437 22.9611 68.5358 81.3090 131.0479 137.9246 160.5216 182.3922 183.9850 209.3464 221.3152 230.0771 269.5735 292.6399 304.4447 320.0790 344.8099 367.1536 372.2759 394.6309 440.3348 460.4781 491.1470 495.5159 521.9674 531.2784 534.1961 536.1958 608.3399 618.6819 642.0437 644.3715 689.5289 691.7943 693.5016 706.1681 851.5698 853.4415 872.0124 874.1323 880.6933 882.9375 1018.6347 1034.1354 1106.1864 1106.3819 1163.9430 1177.2525 1226.3021 1235.0042 1235.4145 1239.6697 1369.4368 1370.2093 1385.1302 1386.7568 1436.3657 1443.4991 1559.6004 1562.5978 1593.4235 1593.9388 3167.3892 3167.4263 3189.6636 3189.6842 3424.4004 3429.2287
redmass: 12.9541 13.9964 18.1596 15.1892 14.4359 9.2909 10.8170 9.3188 29.5210 27.7021 7.4822 6.0617 10.4700 8.0119 8.7585 16.1295 15.5329 11.9838 15.6414 16.9345 7.7228 2.9907 3.7997 8.2910 7.2450 2.0554 1.2025 3.7562 1.5444 10.0606 10.1537 8.3612 8.2499 3.5296 6.9512 5.6337 4.1375 1.4913 1.5396 1.4575 1.4613 8.8886 8.6626 5.8570 5.4707 1.8864 1.9387 1.3796 1.4206 4.3833 2.5592 1.3612 1.7909 9.9176 9.7107 3.6265 3.3143 3.3540 3.4129 8.0762 7.8893 7.3648 7.4348 1.0929 1.0929 1.0930 1.0930 1.0644 1.0647
irintensity: 0.5217 0.0071 0.1706 0.1074 0.0775 0.3775 0.0208 0.0066 0.1440 0.0020 3.0959 0.3679 2.0658 3.0139 18.8383 1.1970 5.3975 0.0090 0.0617 1.2304 0.1519 20.3579 23.1767 11.8585 0.0630 93.9325 111.6740 17.7348 55.8697 0.2957 2.1420 70.8530 20.6465 1.6115 12.4675 7.0628 1.1549 2.0182 0.0956 31.1837 47.1283 47.1657 24.0178 59.7763 1.3389 27.3567 50.4411 389.5378 63.8756 3.7006 0.5529 44.8547 15.2551 22.8552 43.2122 10.4804 20.8022 238.8998 86.1119 51.5531 1.7466 37.1838 33.5208 0.0237 0.2826 1.5880 0.7329 140.2588 39.9351
temp: 298.150 k
press: 1.00000 atm
elementType: 17 17 17 17 16 8 8 6 6 6 6 6 6 6 6 6 6 6 6 1 1 1 1 1 1
symmnumber: 1
zpe: 386677.6 jmol-1
zpe.correction: 0.147278 hartree
zpe.thermalcorrener: 0.165674 hartree
zpe.thermalcorrenthalpy: 0.166618 hartree
zpe.thermalcorrgfe: 0.096174 hartree
zpe.sumelectzpe: -2848.262745 hartree
zpe.sumelectthermal: -2848.244349 hartree
zpe.sumelectthermalent: -2848.243405 hartree
zpe.sumelectthermalfe: -2848.313849 hartree
dipole: -0.0002 0.0013 2.7007
dipole: 2.7007
quadrupole: -158.9561 -144.9183 -143.4794
quadrupole: 2.5134 -0.0012 0.0009
quadrupole: -9.8382 4.1996 5.6386 2.5134 -0.0012 0.0009
hfenergy: -2848.4100228 hartree
pointgroup: C01 [X(C12H6Cl4O2S1)]
dipole: 0.0001315 -1.0625399 -0.0003303 debye
dipolederiv: -0.1061001 -0.0696313 0.0942433 -0.1467332 -0.1690098 0.258873 0.2212506 0.2651514 -0.5280682 -0.1060751 0.0695616 0.0942219 0.1466206 -0.1688039 -0.2587539 0.2212623 -0.2650112 -0.5282777 -0.5663664 -0.3201376 0.0008032 -0.4103756 -0.2679791 0.0116629 -0.0351087 -0.0115575 -0.0494806 -0.5664709 0.3201008 0.0009814 0.4103471 -0.2678849 -0.0117921 -0.0348856 0.0114265 -0.049475 -0.0123165 0.0000073 -0.0247539 0.0000882 0.1963174 0.0000809 -0.3085655 0.000086 -0.1907261 -0.4310061 -0.0509601 0.2262988 -0.0788031 -0.5891409 0.4238296 0.2527014 0.5075597 -0.9535176 -0.4308481 0.0508207 0.2262825 0.078651 -0.5888189 -0.4236936 0.2526767 -0.5073915 -0.9539536 0.201918 0.3016776 -0.1064232 0.1779924 -0.1908043 -0.0455194 0.2035174 0.1310836 -0.2042736 0.2020013 -0.3016488 -0.106596 -0.1780584 -0.1908179 0.0454954 0.2033617 -0.1310696 -0.2043142 0.0872637 0.1313531 -0.2667975 0.0451799 0.3880542 -0.4808822 -0.0671827 -0.4714519 0.8227443 0.0871451 -0.1312143 -0.2668036 -0.0450979 0.3877038 0.4807139 -0.0670743 0.4713168 0.8231955 -0.0346812 -0.0186187 0.1226214 0.0469123 -0.024997 0.1222886 -0.2279606 -0.061541 -0.137635 -0.0346729 0.0186006 0.1226097 -0.0468267 -0.0250024 -0.1222188 -0.2279809 0.0615541 -0.1376701 -0.2516844 -0.1797992 0.2126924 -0.103924 -0.2490536 0.1838444 -0.037516 0.0377063 -0.1408727 -0.2516734 0.1797101 0.2128046 0.1038952 -0.2489292 -0.1838563 -0.0374807 -0.0377767 -0.1409952 -0.2852433 -0.0097458 -0.2706793 -0.0492697 0.0641202 -0.4989595 -0.3328767 -0.3849146 0.6898503 -0.2853515 0.009857 -0.2705734 0.0494125 0.0638219 0.498702 -0.3327532 0.3846548 0.690226 0.8515727 0.5356236 0.1041732 0.6129359 0.3809987 0.0291971 0.2046428 0.0204199 0.1124642 0.8517698 -0.5356002 0.1038858 -0.6129432 0.3808612 -0.0290008 0.2043261 -0.0202214 0.112408 0.0923909 -0.0451038 -0.082108 -0.0262913 0.1073675 -0.0112957 -0.0667998 0.0084166 0.0625852 0.0923754 0.0451336 -0.0821022 0.026311 0.1073721 0.0112965 -0.0668015 -0.0084194 0.0626065 0.0870123 -0.0430802 -0.032659 -0.0627628 0.1352243 0.0172417 -0.0373965 0.0129991 0.0547578 0.086986 0.0430843 -0.0326518 0.0627679 0.1352495 -0.0172276 -0.0373778 -0.0129826 0.0547604 0.3610544 -0.0871334 0.0102461 -0.0483727 0.3170974 -0.0748484 0.0770152 -0.1251812 0.3667842 0.3610003 0.087143 0.0102835 0.0483446 0.3170536 0.0748222 0.0770063 0.1251436 0.3668773 unknown
polarizability: 247.5645258|0.0106518|150.4984583|-6.114847|-0.0012743|194.8094397 unknown
InChI: InChI=1S/C12H6Cl4O2S/c13-5-1-9(17)11(3-7(5)15)19-12-4-8(16)6(14)2-10(12)18/h1-4,17-18H
charge 0 multiplicity 1
25 atoms
Cl 3.232883 1.402393 -2.854198
Cl -3.232644 1.40101 2.854817
Cl 5.054592 1.832268 -0.146568
Cl -5.054868 1.831574 0.147645
S  0.000111 -2.208289 -0.000579
O  1.949301 -1.487103 2.279373
O  -1.949543 -1.486533 -2.279971
C  1.428674 -1.026845 -0.09569
C  -1.428588 -1.027056 0.095175
C  2.216533 -0.844099 1.074618
C  -2.216658 -0.843995 -1.074941
C  1.749529 -0.341188 -1.284332
C  -1.749332 -0.341847 1.284107
C  3.323814 0.034278 1.040168
C  -3.324052 0.034223 -1.040001
C  2.851324 0.535595 -1.313118
C  -2.851234 0.534785 1.313378
C  3.632827 0.718246 -0.14774
C  -3.632958 0.717736 0.148196
H  1.149102 -0.478375 -2.187932
H  -1.148735 -0.479257 2.187561
H  3.924067 0.170288 1.942557
H  -3.924468 0.170469 -1.942244
H  1.171686 -2.102142 2.16319
H  -1.171766 -2.101436 -2.16417
