program: Gaussian 09
title: 000232203
version: EM64L-G09RevD.01
frameworkgroup: C1[X(C19H23Cl3O3)]
method: RPBEPBE
basis: SDD
operation: Freq
keyword: #p
keyword: freq=noraman
keyword: PBEPBE/SDD
title: #p freq=noraman PBEPBE/SDD
converged: YES YES NO NO
title: Mulliken charges:
elementType: Cl Cl Cl O O O C C C C C C C C C C C C C C C C C C C H H H H H H H H H H H H H H H H H H H H H H H
charge: -0.006187 -0.005808 -0.003739 -0.250762 -0.231902 -0.243016 0.411814 -0.272105 -0.192774 -0.564483 0.028151 -0.448185 -0.524393 -0.810079 -0.786848 -0.481972 -0.338394 0.292361 -0.428735 0.491062 -0.322394 -0.250311 -0.106003 -0.186265 -0.108714 0.229434 0.236153 0.228389 0.222375 0.207212 0.203098 0.212716 0.229377 0.214298 0.212008 0.216057 0.233460 0.209535 0.227384 0.211721 0.242277 0.216649 0.256446 0.228776 0.235704 0.277966 0.304874 0.283772
chargesum: 0.00000
title: Mulliken charges with hydrogens summed into heavy atoms:
elementType: Cl Cl Cl O O O C C C C C C C C C C C C C C C C C C C
charge: -0.006187 -0.005808 -0.003739 -0.250762 -0.231902 -0.243016 0.411814 -0.042671 0.043379 -0.113719 0.235363 -0.032371 -0.080719 -0.148553 -0.138207 -0.023046 0.146828 0.292361 0.084935 0.491062 -0.322394 0.054562 -0.106003 0.097506 -0.108714
polarizability: 3.06768103e+02 -1.09913803e+01 2.62836923e+02 -1.61915048e+01 -5.94768836e-01 1.58977509e+02
1716.lowfreq: -13.2657 -9.8220 -3.8315 0.0008 0.0014 0.0018 4.2841 10.8033 17.4286
frequency: -9.7216 8.1503 16.9721 29.3113 37.9590 48.3572 71.2852 83.5019 112.6668 120.9429 137.8904 146.8966 160.4291 166.3651 180.7308 197.4824 204.4575 211.7811 220.8670 247.4265 258.6404 273.4359 308.7480 309.7770 325.3286 342.0184 354.7805 370.8568 390.9635 409.0179 417.9091 432.5645 442.2708 448.3479 493.9652 511.9607 528.4199 537.6290 574.1543 598.7246 611.3263 646.9553 656.9825 677.0542 697.0398 704.4218 770.3438 778.1903 801.6112 815.4711 836.6829 840.9060 848.7127 858.6833 861.5388 881.3428 902.1795 927.0678 934.6995 943.0806 952.1175 964.4305 988.2453 990.6672 1003.4859 1019.7543 1029.2376 1039.5965 1049.9714 1068.6274 1078.3548 1082.9453 1110.0284 1120.4425 1144.8564 1160.4604 1163.7710 1199.2629 1201.8009 1203.8424 1216.0981 1231.6671 1232.8159 1236.9362 1245.2377 1250.5661 1257.6085 1279.5910 1283.0242 1290.3347 1298.8504 1318.2190 1327.0119 1329.1109 1339.4861 1352.5076 1357.4804 1370.1570 1375.2183 1377.5412 1396.1913 1449.1792 1455.0408 1456.3884 1460.8681 1464.5974 1470.4341 1474.4168 1480.1725 1484.3341 1494.1328 1502.9833 1558.4501 1586.1405 1638.0078 2965.4576 2967.6436 2971.5701 2975.3208 2982.0105 2989.5539 2997.5763 3003.2950 3018.5940 3024.2574 3033.2074 3034.5157 3041.4404 3047.7062 3049.2913 3055.6244 3076.4346 3082.1124 3096.2661 3111.6221 3123.2558 3175.5490 3181.7048
redmass: 5.5545 8.4377 4.9244 6.6221 6.3644 6.1651 8.9806 5.3575 3.4850 6.7167 2.7939 5.7882 5.8866 1.2235 23.7765 2.0792 2.3428 2.9397 3.9792 2.4419 4.9389 3.0204 1.8401 13.9296 6.1682 4.2659 7.4450 2.5130 3.5191 4.1086 2.1070 3.0965 3.1249 3.1171 9.0112 2.6106 4.3333 3.9119 3.5409 6.2777 5.9361 7.3271 2.6692 4.0796 5.0782 5.0771 1.5486 2.0314 1.9647 2.6462 1.9593 2.4937 5.6380 2.3637 1.4336 2.2483 2.5746 4.0241 1.4683 1.8613 1.9149 1.8227 4.1184 1.3929 2.8265 1.5919 1.8596 5.0147 2.0976 2.7250 1.5473 1.5526 1.5516 1.9442 2.0871 2.0254 2.8438 1.6224 1.4485 1.6766 2.1453 3.1372 1.5204 1.6568 1.3651 1.2213 1.7338 1.2805 1.4847 1.3219 1.6764 1.3925 1.2668 5.6286 1.3983 1.4302 1.4403 4.7468 1.5325 1.2256 1.2032 1.4953 1.5150 1.1960 1.0690 1.0709 1.0597 1.0869 1.0682 1.0717 1.0703 1.0682 9.0192 8.2923 9.1268 1.0779 1.0391 1.0393 1.0602 1.0596 1.0629 1.0653 1.0850 1.0804 1.0945 1.0770 1.0593 1.1027 1.1006 1.0990 1.0979 1.0979 1.0964 1.1038 1.1095 1.0982 1.0920 1.0932
irintensity: 0.0755 0.0296 0.1581 0.7571 0.4674 0.3133 0.2437 0.6796 0.5459 0.2723 0.0616 0.9150 2.2588 0.1692 0.1530 0.0611 0.2908 0.2192 0.6443 1.6396 3.7727 5.7814 0.0263 2.3551 16.0400 12.4033 3.1313 0.8165 1.0877 1.1662 1.3388 5.8108 10.4878 0.1967 15.3189 0.9088 0.1650 10.8918 0.4752 1.3840 2.8680 71.4472 0.7133 9.4294 14.2688 8.7044 0.2177 1.2852 4.3657 3.2764 5.6715 4.6949 3.5836 6.7854 38.3287 3.1116 13.5893 39.3081 1.7445 4.0676 4.6102 6.7054 26.1533 0.4072 103.9493 4.8314 0.8114 257.5194 2.5528 17.9463 2.3750 1.1553 0.4021 44.1521 35.7641 28.6436 303.1296 6.0360 8.5197 14.8304 0.6145 38.6590 0.0783 6.0133 16.6627 101.9932 8.3592 1.9108 1.6182 0.1358 3.8221 2.0287 3.4774 62.4310 1.5360 1.6089 31.1349 3.8029 4.9870 15.4192 19.8403 110.2241 159.0108 36.8452 0.2921 5.3908 8.8805 5.8726 1.3970 23.7273 16.6709 5.8873 2.7288 26.7543 168.9967 8.4596 33.4096 51.9149 37.2649 15.2816 50.9753 21.7528 49.6581 64.4409 17.5752 29.8580 19.9316 8.3130 69.5418 13.8048 70.9030 37.2307 48.6948 46.8041 15.0284 4.0919 12.1276 0.2540
temp: 298.150 k
press: 1.00000 atm
elementType: 17 17 17 8 8 8 6 6 6 6 6 6 6 6 6 6 6 6 6 6 6 6 6 6 6 1 1 1 1 1 1 1 1 1 1 1 1 1 1 1 1 1 1 1 1 1 1 1
symmnumber: 1
zpe: 996752.4 jmol-1
zpe.correction: 0.379643 hartree
zpe.thermalcorrener: 0.404330 hartree
zpe.thermalcorrenthalpy: 0.405275 hartree
zpe.thermalcorrgfe: 0.321775 hartree
zpe.sumelectzpe: -2341.729224 hartree
zpe.sumelectthermal: -2341.704536 hartree
zpe.sumelectthermalent: -2341.703592 hartree
zpe.sumelectthermalfe: -2341.787091 hartree
dipole: 4.8822 -1.5124 -1.4808
dipole: 5.3212
quadrupole: -168.2433 -177.3288 -167.4634
quadrupole: 1.2077 2.8026 1.0571
quadrupole: 2.7685 -6.3170 3.5484 1.2077 2.8026 1.0571
hfenergy: -2342.1088667 hartree
pointgroup: C01 [X(C19H23Cl3O3)]
dipole: -1.8644678 -0.4173819 -0.8558408 debye
polarizability: 304.0316767|17.1175831|169.8974885|19.2081207|-29.6457463|254.6533701 unknown
InChI: InChI=1S/C19H23Cl3O3/c1-19(2)12-4-3-11(13(19)7-12)5-6-24-18(23)10-25-17-9-15(21)14(20)8-16(17)22/h8-9,11-13H,3-7,10H2,1-2H3
charge 0 multiplicity 1
48 atoms
Cl 5.711694 1.362088 -2.22817
Cl 3.855577 -1.311058 3.30856
Cl 6.957453 -0.262237 2.912417
O  -0.441256 0.211897 -2.004463
O  0.509661 0.466781 0.11511
O  3.008632 0.310532 -1.619304
C  -6.444999 -0.541757 0.128285
C  -4.957272 -1.027959 -0.134646
C  -5.914336 -0.134584 1.568357
C  -4.823833 -1.257196 1.416347
C  -4.049761 0.154365 -0.570902
C  -5.221509 1.247223 1.52632
C  -3.985223 1.234447 0.567361
C  -7.049962 0.544263 -0.780695
C  -7.433922 -1.729206 0.19104
C  -2.633131 -0.354509 -0.951704
C  -1.745522 0.766974 -1.504802
C  0.585483 0.104753 -1.081812
C  1.812532 -0.531305 -1.743685
C  3.855995 0.144419 -0.51955
C  5.188868 0.611007 -0.668165
C  3.467599 -0.431671 0.712556
C  4.40587 -0.564243 1.754832
C  6.118948 0.490488 0.376818
C  5.729458 -0.108418 1.593663
H  -4.83254 -1.899486 -0.804533
H  -6.633862 -0.210252 2.403236
H  -5.176593 -2.250351 1.735338
H  -3.839329 -1.068692 1.877057
H  -4.494719 0.604547 -1.483102
H  -5.953299 2.020557 1.224581
H  -4.879464 1.521063 2.54342
H  -3.082678 1.02465 1.173818
H  -3.832867 2.242159 0.136011
H  -7.203881 0.150757 -1.804423
H  -8.039219 0.859362 -0.396138
H  -6.424203 1.448736 -0.86252
H  -7.621857 -2.132905 -0.822683
H  -7.066431 -2.559972 0.818182
H  -8.4061 -1.401197 0.606822
H  -2.148718 -0.80517 -0.06354
H  -2.723229 -1.145751 -1.721727
H  -1.521279 1.532434 -0.742896
H  -2.184977 1.231927 -2.402579
H  1.992139 -1.531548 -1.302266
H  1.639002 -0.62664 -2.824937
H  2.424447 -0.705746 0.887193
H  7.143112 0.847926 0.245015
