program: Gaussian 09
title: 000022010
version: EM64L-G09RevD.01
frameworkgroup: C1[X(C16H20N2)]
method: RPBEPBE
basis: SDD
operation: Freq
keyword: #pfreq=noraman
keyword: PBEPBE/SDD
title: #p freq=noraman PBEPBE/SDD
converged: YES YES NO NO
title: Mulliken charges:
elementType: N N C C C C C C C C C C C C C C C C H H H H H H H H H H H H H H H H H H H H
charge: -0.046513 -0.681592 -0.383106 -0.545957 -0.390844 0.231536 -0.393596 -0.520657 -0.030710 0.189306 0.332836 -0.259663 0.437749 -0.395519 -0.516049 -0.446801 -0.281651 -0.698507 0.213434 0.197718 0.170734 0.213003 0.204439 0.186326 0.203621 0.214128 0.193106 0.236539 0.188457 0.233483 0.194798 0.236530 0.307018 0.316078 0.221529 0.209537 0.209002 0.250257
chargesum: 0.00000
title: Mulliken charges with hydrogens summed into heavy atoms:
elementType: N N C C C C C C C C C C C C C C C C
charge: -0.046513 -0.058496 0.028046 -0.162221 -0.000079 0.231536 0.024152 -0.091012 -0.030710 0.189306 0.332836 -0.259663 0.437749 -0.207062 -0.087767 -0.210271 -0.060121 -0.029711
polarizability: 2.60983015e+02 4.55377867e+00 2.07279512e+02 6.74924545e+00 9.13686494e+00 1.09773348e+02
1716.lowfreq: -11.8978 -0.0005 0.0004 0.0007 4.6968 10.3238 44.7808 53.9698 68.7439
frequency: 44.6032 53.9598 68.7134 88.1288 134.1258 157.7627 172.2087 195.1614 234.0580 254.8382 282.5814 296.3694 327.6922 332.7628 350.1140 364.5504 374.9789 395.4713 405.3947 454.6572 473.1500 494.1400 525.8781 542.0938 554.6925 573.7577 591.6640 649.5224 670.2648 722.7537 739.9260 754.0371 777.5959 800.7246 825.7033 829.0907 832.9018 859.3518 882.7236 890.9577 918.4164 942.7289 959.1310 961.7582 996.6279 1020.4965 1051.5053 1058.6587 1065.5496 1069.7162 1092.8697 1112.6878 1129.3922 1138.4357 1187.7557 1202.0775 1203.9310 1219.3982 1235.6398 1243.3542 1251.1689 1266.7982 1277.5557 1315.5548 1316.2653 1322.9441 1336.8356 1338.8247 1354.7190 1359.6557 1375.2832 1387.2353 1407.8231 1428.9437 1452.3699 1458.7951 1461.5711 1462.7630 1464.1470 1469.4287 1470.8719 1485.0762 1489.6279 1503.0410 1562.8086 1582.0543 1611.9053 1640.7183 2954.2874 2962.4920 2967.1340 2971.3449 2975.0652 2978.3605 2992.6181 3012.9805 3020.4869 3029.1407 3038.5145 3054.1401 3065.5183 3073.6950 3095.6915 3106.4378 3121.1576 3151.0594 3582.4234 3716.9451
redmass: 3.2642 3.1436 2.9336 3.4202 3.1213 2.4796 3.4222 1.7759 1.5561 2.3090 2.7335 3.2588 2.3115 1.9461 2.0590 2.1116 2.7950 2.6525 1.4796 3.1310 2.1845 2.9323 4.0267 4.2975 3.3819 3.2462 3.9662 5.3006 4.2417 2.9751 3.3904 1.5178 1.3342 2.6426 1.6169 4.2606 2.9484 2.2305 2.6150 1.3820 2.8107 1.9257 2.2413 1.3549 2.6379 1.9479 2.1421 2.0054 1.9356 1.9225 1.8573 1.8395 1.7400 1.4372 1.3432 1.2616 1.3131 2.9858 2.5204 1.3774 1.2749 1.2371 1.5792 1.4540 1.4097 1.6748 1.7773 1.5935 1.4382 2.0317 1.2226 3.6731 5.2780 3.7692 1.5697 1.2197 1.0869 1.1689 1.2895 1.1008 1.0849 1.1806 1.0725 3.7276 7.4964 6.2759 6.1677 1.2309 1.0616 1.0673 1.0613 1.0644 1.0621 1.0353 1.0612 1.0974 1.0946 1.1026 1.1023 1.0992 1.0935 1.0996 1.1008 1.0859 1.0903 1.0983 1.0450 1.1027
irintensity: 0.5468 0.1440 0.2450 5.4045 0.0170 0.0865 5.2981 1.6583 0.6424 0.3328 1.7790 1.1120 6.1038 9.5524 62.3379 57.6108 47.2172 7.8633 32.7397 0.7566 0.4070 2.9015 2.8815 0.0749 1.5556 0.7189 1.3312 2.2020 3.9429 0.6946 5.9615 74.0915 4.1242 2.2868 6.0703 1.8551 6.2300 6.9063 4.7576 1.9902 24.1184 0.5190 16.9478 1.2754 1.3511 10.3067 9.1545 0.9247 17.7024 3.3123 9.7144 1.3508 2.4105 2.1100 6.9879 1.8272 6.4058 1.4533 0.4780 0.5961 3.1314 0.4891 5.5533 5.7575 1.8434 2.1017 13.5235 8.9797 0.2593 2.9652 12.9373 27.7062 46.1330 13.3093 22.7671 3.4025 2.7411 6.7050 12.9679 8.0360 15.3592 22.4771 3.7398 120.1227 40.2746 23.6289 4.5995 291.5809 29.9174 29.1379 27.3136 55.9059 30.4034 51.4453 48.8147 76.6710 64.7215 16.1947 106.3277 5.7653 15.9115 49.9451 32.2963 10.1065 27.8976 41.6306 42.0275 25.2000
temp: 298.150 k
press: 1.00000 atm
elementType: 7 7 6 6 6 6 6 6 6 6 6 6 6 6 6 6 6 6 1 1 1 1 1 1 1 1 1 1 1 1 1 1 1 1 1 1 1 1
symmnumber: 1
zpe: 852419.8 jmol-1
zpe.correction: 0.324670 hartree
zpe.thermalcorrener: 0.341014 hartree
zpe.thermalcorrenthalpy: 0.341958 hartree
zpe.thermalcorrgfe: 0.281558 hartree
zpe.sumelectzpe: -729.914405 hartree
zpe.sumelectthermal: -729.898061 hartree
zpe.sumelectthermalent: -729.897117 hartree
zpe.sumelectthermalfe: -729.957516 hartree
dipole: -2.0944 3.2234 0.6218
dipole: 3.8940
quadrupole: -96.8052 -94.8005 -112.5606
quadrupole: -0.9413 1.4517 2.0207
quadrupole: 4.5835 6.5882 -11.1718 -0.9413 1.4517 2.0207
hfenergy: -730.2390748 hartree
pointgroup: C01 [X(C16H20N2)]
dipole: -0.801562 1.2814221 0.2501785 debye
polarizability: 261.2035352|3.7370469|207.1437448|5.8726975|9.0096364|109.6885945 unknown
InChI: InChI=1S/C16H20N2/c1-2-11-7-6-9-13-15(17)12-8-4-3-5-10-14(12)18-16(11)13/h6-7,9H,2-5,8,10,17H2,1H3
charge 0 multiplicity 1
38 atoms
N  0.259105 -1.080425 -0.459955
N  -0.700847 3.021818 0.158405
C  -3.758423 0.557969 0.745309
C  -2.883406 1.107327 -0.422279
C  -4.187133 -0.916481 0.557051
C  -1.41195 0.72732 -0.335563
C  -3.032228 -1.941182 0.458567
C  -2.065968 -1.725121 -0.74288
C  -1.020373 -0.64383 -0.512234
C  -0.400584 1.681877 -0.059278
C  0.986834 1.249934 -0.002643
C  1.262742 -0.151834 -0.21969
C  2.626365 -0.629777 -0.190434
C  2.075508 2.142942 0.251102
C  2.917721 -2.106071 -0.393715
C  3.659244 0.287257 0.049843
C  3.390073 1.669359 0.274611
C  2.660606 -2.941665 0.889319
H  -3.20743 0.674846 1.699289
H  -4.674915 1.17668 0.825855
H  -3.007478 2.206128 -0.471322
H  -3.306737 0.733071 -1.377123
H  -4.851692 -1.205678 1.396164
H  -4.801185 -0.987681 -0.365923
H  -3.477876 -2.951337 0.364813
H  -2.443971 -1.943409 1.397616
H  -2.667771 -1.501179 -1.64889
H  -1.507849 -2.656116 -0.940575
H  1.906309 3.21212 0.429661
H  2.266508 -2.497833 -1.194934
H  3.970747 -2.232365 -0.711117
H  4.696521 -0.068833 0.066077
H  -1.660266 3.350746 0.151437
H  0.032539 3.700486 0.330623
H  4.218849 2.360708 0.463557
H  3.280631 -2.583719 1.731862
H  2.898305 -4.007487 0.71411
H  1.598374 -2.86546 1.177585
