program: Gaussian 09
title: 000232144
version: EM64L-G09RevD.01
frameworkgroup: C1[X(C10H24N2O2)]
method: RPBEPBE
basis: SDD
operation: Freq
keyword: #p
keyword: freq=noraman
keyword: PBEPBE/SDD
title: #p freq=noraman PBEPBE/SDD
converged: YES YES NO NO
title: Mulliken charges:
elementType: O O N N C C C C C C C C C C H H H H H H H H H H H H H H H H H H H H H H H H
charge: -0.455799 -0.456810 -0.124431 -0.570762 -0.375188 -0.386452 -0.364248 -0.372454 -0.365784 -0.357912 -0.358970 -0.394114 -0.321184 -0.329691 0.192002 0.206995 0.205675 0.192316 0.188438 0.190365 0.188960 0.191329 0.218231 0.224494 0.219175 0.223590 0.218331 0.181491 0.206253 0.177929 0.192391 0.200035 0.204270 0.191910 0.258421 0.271527 0.344801 0.344873
chargesum: 0.00000
title: Mulliken charges with hydrogens summed into heavy atoms:
elementType: O O N N C C C C C C C C C C
charge: -0.110998 -0.111937 -0.124431 -0.040813 0.023810 0.011539 0.014555 0.007834 0.076940 0.084852 0.040851 -0.009932 0.071242 0.066488
polarizability: 1.58498189e+02 -1.92677215e-02 1.27895251e+02 -1.73308327e+00 -6.79948016e-01 1.12001157e+02
1716.lowfreq: -7.6558 -2.1571 -0.0005 0.0006 0.0010 4.5554 22.8358 31.4256 36.9182
frequency: 22.5636 31.0318 36.7294 47.1792 62.0726 70.0203 83.0457 90.7037 101.0047 118.5936 149.8001 168.8955 193.0072 209.4253 234.8188 241.7196 245.4744 250.8774 284.4640 329.8833 359.5913 397.0547 400.7085 482.2274 515.8299 536.6539 605.5850 725.4410 746.2612 789.7955 806.4084 813.1036 843.2514 871.6052 946.1677 968.0466 972.4379 974.6755 994.5810 1003.2458 1017.8207 1039.9034 1048.7055 1073.7314 1076.0518 1078.8791 1094.6193 1112.1079 1124.6181 1148.8111 1172.7182 1192.8460 1204.8478 1208.3391 1219.2032 1230.1117 1252.1038 1260.4991 1273.2199 1276.9092 1282.3239 1289.3806 1293.0550 1297.8659 1304.6921 1336.0771 1347.6439 1352.5380 1355.5452 1373.5053 1387.6267 1408.2159 1413.1964 1461.3891 1464.0060 1465.3640 1468.0089 1473.2799 1475.1800 1481.1232 1485.7885 1487.9926 1493.6119 1638.8468 2857.8375 2860.1330 2914.4019 2920.7599 2944.4125 2946.0505 2950.4473 2953.9254 2960.6023 2972.3764 2987.8356 3001.5666 3004.1790 3004.4964 3007.1364 3014.1019 3038.7800 3047.1145 3050.3153 3058.7976 3450.0306 3577.0543 3577.5840 3577.6955
redmass: 4.4808 3.3298 1.8867 4.1528 3.3285 2.9451 2.5719 2.2521 2.1407 2.3093 2.1326 2.5794 2.8473 3.0772 2.1614 1.4190 1.0889 1.1806 2.7451 4.0570 3.2225 3.0369 3.4535 3.2101 3.3953 3.2651 1.2854 1.0675 1.1024 1.1737 1.1794 1.1495 3.7237 1.2686 1.8436 6.1595 5.7386 1.7253 3.0175 2.0745 2.6899 2.5035 2.2560 1.9969 2.3775 2.0094 2.5843 1.9287 1.7666 1.4223 1.3706 1.3607 1.2787 1.2810 1.3470 1.5756 1.6578 1.4237 1.2022 1.0785 1.1239 1.1048 1.2113 1.1967 1.2990 1.4147 1.3555 1.3368 1.6479 1.4090 1.4621 1.4495 1.4719 1.0757 1.0705 1.0737 1.0782 1.0789 1.0922 1.0896 1.0863 1.0902 1.0908 1.0941 1.0703 1.0715 1.0692 1.0695 1.0572 1.0564 1.0588 1.0614 1.0629 1.0609 1.0961 1.1031 1.0915 1.0991 1.0896 1.0972 1.1018 1.1009 1.0969 1.0943 1.0448 1.0666 1.0974 1.0666
irintensity: 0.2917 1.0548 1.9989 0.2230 0.4547 2.3237 14.9839 9.3178 2.5472 1.3221 1.2133 2.2734 4.1269 9.4512 39.4048 34.4172 124.5700 165.2818 15.4826 8.3202 6.4624 5.0635 11.2477 21.7478 0.4746 2.7321 223.3949 11.6334 0.2459 2.9447 4.1477 4.6857 23.3204 3.3365 1.2559 149.8513 44.7644 5.9928 8.4615 34.1666 25.8100 4.9821 13.5836 14.6583 4.4407 3.3210 5.6136 28.3352 1.4855 5.3197 6.1738 5.8599 51.0102 33.2073 0.6847 4.2916 8.0530 4.8002 0.0031 1.2665 5.8790 0.8347 10.5967 0.3530 9.9598 0.2275 1.8723 0.8536 0.1227 7.0410 17.2422 0.0566 0.0828 0.6174 0.0973 1.0746 4.9886 3.5236 2.2832 12.6447 9.9697 4.9489 7.5756 40.0726 80.2062 113.3917 24.8231 90.4034 64.3254 77.7214 0.8708 4.7851 67.0226 59.7823 3.9397 43.5362 44.7522 29.3204 37.4006 1.9233 0.7475 123.8053 110.5310 67.1783 2.1923 3.5692 0.1641 3.2724
temp: 298.150 k
press: 1.00000 atm
elementType: 8 8 7 7 6 6 6 6 6 6 6 6 6 6 1 1 1 1 1 1 1 1 1 1 1 1 1 1 1 1 1 1 1 1 1 1 1 1
symmnumber: 1
zpe: 887293.7 jmol-1
zpe.correction: 0.337952 hartree
zpe.thermalcorrener: 0.357176 hartree
zpe.thermalcorrenthalpy: 0.358120 hartree
zpe.thermalcorrgfe: 0.287302 hartree
zpe.sumelectzpe: -654.156651 hartree
zpe.sumelectthermal: -654.137427 hartree
zpe.sumelectthermalent: -654.136483 hartree
zpe.sumelectthermalfe: -654.207302 hartree
dipole: -1.0151 0.4743 -2.3741
dipole: 2.6252
quadrupole: -87.9438 -89.7664 -84.5157
quadrupole: -7.3828 -11.8007 0.1019
quadrupole: -0.5352 -2.3577 2.8930 -7.3828 -11.8007 0.1019
hfenergy: -654.4946032 hartree
pointgroup: C01 [X(C10H24N2O2)]
dipole: 0.3993138 0.1781844 0.9356945 debye
polarizability: 158.4866916|0.3747566|127.8783444|-1.8333454|0.8760034|112.0295609 unknown
InChI: InChI=1S/C10H24N2O2/c11-5-3-1-2-4-6-12(7-9-13)8-10-14/h13-14H,1-11H2
charge 0 multiplicity 1
38 atoms
O  -4.250931 -3.015621 0.250348
O  -3.477687 3.393207 0.161941
N  -2.041033 -0.036641 -0.237071
N  6.871631 -0.147778 -0.003136
C  0.464749 0.082068 0.064547
C  -0.719481 -0.465377 -0.759846
C  1.835956 -0.349215 -0.502576
C  3.027757 0.18767 0.321785
C  -3.130014 -1.012179 -0.4817
C  -2.400685 1.363546 -0.561905
C  4.399032 -0.249651 -0.238599
C  5.587639 0.302921 0.573746
C  -3.18087 -2.073588 0.626169
C  -3.123569 2.034996 0.613599
H  0.416522 1.189608 0.099719
H  0.354727 -0.268954 1.109509
H  -0.685586 -1.571739 -0.73208
H  -0.589486 -0.175049 -1.833391
H  1.930275 0.0023 -1.551697
H  1.888961 -1.457588 -0.54117
H  2.976867 1.296411 0.35646
H  2.931622 -0.160618 1.37153
H  -3.029669 -1.525732 -1.465698
H  -4.100589 -0.484095 -0.496752
H  -3.044591 1.440303 -1.468184
H  -1.482274 1.938889 -0.774113
H  4.474178 -1.354149 -0.256797
H  4.488542 0.090892 -1.292828
H  5.525041 -0.083996 1.609732
H  5.485816 1.415578 0.640884
H  -2.202808 -2.595182 0.703887
H  -3.393403 -1.580255 1.597167
H  -2.447767 2.060455 1.492994
H  -4.034017 1.457541 0.883642
H  7.010438 0.147877 -0.975336
H  7.692349 0.055227 0.575883
H  -4.33668 -3.712925 0.947117
H  -3.944761 3.871944 0.891124
