program: Gaussian 09
title: 000232196
version: EM64L-G09RevD.01
frameworkgroup: C1[X(C16H22N2O5)]
method: RPBEPBE
basis: SDD
operation: Freq
keyword: #p
keyword: freq=noraman
keyword: PBEPBE/SDD
title: #p freq=noraman PBEPBE/SDD
converged: YES YES NO NO
title: Mulliken charges:
elementType: O O O O O N N C C C C C C C C C C C C C C C C H H H H H H H H H H H H H H H H H H H H H H
charge: -0.295714 -0.243061 -0.224756 -0.230439 -0.278420 -0.423685 -0.698817 0.144276 -0.645880 0.532644 0.202477 0.250172 -0.396963 -0.402420 0.256809 -0.430459 -0.431863 0.488928 -0.255437 -0.254625 -0.788584 -0.657267 -0.665744 0.260369 0.270818 0.348765 0.237782 0.243996 0.213314 0.213454 0.225980 0.238166 0.224988 0.239364 0.219086 0.249618 0.256227 0.254186 0.231709 0.218738 0.250288 0.232606 0.214957 0.302480 0.301940
chargesum: 0.00000
title: Mulliken charges with hydrogens summed into heavy atoms:
elementType: O O O O O N N C C C C C C C C C C C C C C C C
charge: -0.295714 -0.243061 -0.224756 -0.230439 -0.278420 -0.074920 -0.094397 0.144276 -0.114693 0.532644 0.202477 0.250172 -0.159181 -0.158423 0.256809 -0.217146 -0.218410 0.488928 0.208708 0.209726 -0.063654 0.047366 0.032107
polarizability: 2.47358074e+02 8.71315408e+00 1.95796871e+02 1.57339732e+01 -1.35007400e+01 1.69716534e+02
1716.lowfreq: -11.8049 -3.1598 -0.0005 -0.0004 -0.0004 4.3927 16.2602 20.2846 34.0273
frequency: 9.4179 19.8708 33.8378 34.3833 48.9120 53.3846 55.9524 63.2136 79.5659 94.4539 100.5335 105.0528 110.9631 131.4311 151.8291 168.8299 197.2999 200.3775 214.0442 248.7369 286.9660 292.7261 305.6627 325.0746 330.0377 341.4810 350.3115 360.6727 366.7324 398.3637 414.0940 420.8154 441.6536 492.8103 514.2245 518.4596 556.7466 576.8031 604.5001 619.0769 639.9245 650.5687 713.7173 724.7585 737.4492 768.5970 783.4079 797.3958 816.3276 819.2400 820.9431 826.7072 838.2276 842.3749 887.5085 937.2900 944.3034 960.5762 975.9693 999.1295 1001.1453 1004.6015 1013.0151 1015.3856 1033.5095 1041.5882 1094.7113 1097.1310 1118.1714 1135.4357 1146.7175 1156.6102 1157.2994 1162.9298 1190.7130 1222.6872 1251.3219 1273.2302 1276.1609 1279.8731 1311.6073 1315.5640 1323.9614 1352.0515 1354.7389 1384.7646 1386.0229 1392.2160 1393.0953 1435.0474 1447.0656 1456.1985 1458.0950 1461.7698 1462.4082 1462.6850 1465.5844 1480.1213 1483.4328 1484.8228 1520.5030 1580.8524 1604.2901 1626.4090 1632.1601 1639.1631 1643.8519 2994.7097 2995.5738 2996.0117 3034.8691 3035.1755 3037.8171 3089.9785 3090.7998 3091.3307 3097.8014 3098.0946 3103.0083 3108.6705 3110.7516 3110.9074 3123.9642 3124.2347 3131.2268 3138.1674 3551.1860 3568.0549 3708.6025
redmass: 2.9963 4.3274 3.6228 4.6631 3.0865 1.5713 2.9636 2.3435 5.3359 3.3590 3.8390 7.4235 4.4100 3.6696 5.4798 3.0447 3.7712 1.5247 1.4070 4.1196 4.3899 2.8694 2.8000 1.9500 1.6908 3.6393 5.5703 4.4948 1.0475 2.3267 2.7687 3.3598 3.5915 4.1480 4.5724 3.8879 2.7608 2.8203 4.1241 1.7494 6.4160 4.0527 3.6667 3.7234 3.2823 3.5481 3.3503 1.9865 1.5026 1.9502 1.2950 2.9335 3.7385 2.7017 2.9344 3.2260 1.3846 1.3502 2.7678 2.0556 2.5662 2.5970 2.5794 2.2225 2.4388 1.6626 2.2145 2.1467 2.0496 1.6491 5.0687 1.6496 1.7306 3.4742 1.1039 2.5981 1.7754 1.2059 1.1234 1.7729 2.8524 1.5548 1.2713 1.2788 1.2749 1.2393 5.1808 1.2291 1.2339 3.1597 1.0990 1.0937 1.0934 1.0818 1.0668 1.0655 1.0982 1.8624 1.0566 1.0552 3.0778 6.5967 6.6503 9.4056 2.0009 7.1716 2.0994 1.0364 1.0363 1.0362 1.0597 1.0595 1.0599 1.0970 1.0988 1.0973 1.1031 1.1033 1.1031 1.0874 1.0995 1.0873 1.1064 1.1065 1.0961 1.0970 1.0782 1.0447 1.1040
irintensity: 1.5971 0.3974 1.3793 3.7372 2.1175 0.6457 0.7071 0.2618 10.3284 4.8209 0.9960 0.9943 1.1725 2.2399 1.2725 2.0597 2.9780 0.0532 2.5557 5.9444 4.9698 9.3857 1.8423 130.3875 124.5834 52.2662 18.6292 9.5082 1.2043 0.4173 0.4191 4.1616 0.4742 10.0094 7.8578 33.3806 11.0647 50.0170 45.1222 9.4006 0.2958 40.9285 1.9376 7.4542 0.5645 4.9746 15.3062 11.4087 4.5061 14.5378 2.8145 19.5195 17.7882 20.0886 5.3962 9.6162 0.7722 0.3696 17.2324 8.6000 1.9765 2.5682 42.6108 81.5379 94.0892 16.5500 97.1729 0.8929 148.0319 117.6373 162.0312 14.8228 5.2784 205.0814 23.2930 5.8721 29.1195 5.0333 5.3013 21.3441 59.1671 33.9381 1.5617 0.2971 2.5254 60.6122 5.7420 17.2596 34.7139 1.1198 61.7718 20.1146 14.9434 22.9202 20.1588 38.1431 46.0784 201.0278 20.7129 24.5403 125.6412 2.4919 160.5559 180.1227 4.9342 127.6779 240.1651 20.2775 17.3065 9.0786 37.5797 14.3217 5.1404 38.6679 12.8828 29.0369 0.9306 0.9465 1.4070 7.1550 11.8441 33.0440 29.1834 22.9461 35.0132 2.5050 68.7009 69.8295 18.8087
temp: 298.150 k
press: 1.00000 atm
elementType: 8 8 8 8 8 7 7 6 6 6 6 6 6 6 6 6 6 6 6 6 6 6 6 1 1 1 1 1 1 1 1 1 1 1 1 1 1 1 1 1 1 1 1 1 1
symmnumber: 1
zpe: 949209.1 jmol-1
zpe.correction: 0.361535 hartree
zpe.thermalcorrener: 0.387118 hartree
zpe.thermalcorrenthalpy: 0.388062 hartree
zpe.thermalcorrgfe: 0.302282 hartree
zpe.sumelectzpe: -1106.810059 hartree
zpe.sumelectthermal: -1106.784476 hartree
zpe.sumelectthermalent: -1106.783532 hartree
zpe.sumelectthermalfe: -1106.869311 hartree
dipole: 3.9976 3.4133 1.7636
dipole: 5.5445
quadrupole: -106.8257 -131.7100 -129.7724
quadrupole: 0.3251 10.0377 2.4756
quadrupole: 15.9436 -8.9406 -7.0030 0.3251 10.0377 2.4756
hfenergy: -1107.1715933 hartree
pointgroup: C01 [X(C16H22N2O5)]
dipole: 1.831436 1.1817916 0.0874124 debye
polarizability: 250.6272498|0.4130184|179.9365628|5.5663549|-20.5918353|182.3076673 unknown
InChI: InChI=1S/C16H22N2O5/c1-4-22-14(20)16(18-11(3)19,15(21)23-5-2)10-12-6-8-13(17)9-7-12/h6-9,18H,4-5,10,17H2,1-3H3
charge 0 multiplicity 1
45 atoms
O  0.392685 2.095608 0.487861
O  -2.762776 -0.791338 -0.943103
O  -0.579238 1.694729 -1.591079
O  -2.977741 0.518682 0.971805
O  -1.413556 -2.140809 1.91621
N  -0.257761 -0.167554 1.541402
N  5.713672 -1.218803 -0.700992
C  -0.704075 -0.057692 0.147876
C  -0.078724 -1.168392 -0.77812
C  1.439545 -1.18184 -0.761153
C  -0.312861 1.324455 -0.428091
C  -2.272509 -0.085474 0.134938
C  2.156467 -1.981597 0.166535
C  2.196019 -0.401361 -1.674763
C  -0.66243 -1.209513 2.349381
C  3.564632 -1.999458 0.194707
C  3.604718 -0.405871 -1.661215
C  4.315527 -1.20569 -0.720193
C  0.820775 3.459621 0.033502
C  -4.25448 -0.839954 -1.08022
C  -0.176234 -1.154565 3.792068
C  -0.302201 4.474324 0.256563
C  -4.766221 0.397509 -1.82129
H  -0.465876 -0.990587 -1.794641
H  -0.490953 -2.1272 -0.422715
H  0.314317 0.597357 1.903385
H  1.599265 -2.614975 0.867904
H  1.670727 0.210296 -2.419216
H  4.090336 -2.636561 0.917314
H  4.161599 0.199921 -2.387417
H  1.707569 3.668067 0.652457
H  1.104081 3.391044 -1.030995
H  -4.425788 -1.768419 -1.647286
H  -4.691093 -0.922595 -0.06984
H  0.657443 -0.447538 3.943852
H  0.140733 -2.162664 4.105356
H  -1.017503 -0.853945 4.442227
H  -1.17394 4.240699 -0.376785
H  -0.621833 4.486545 1.312421
H  0.056722 5.485877 -0.009531
H  -4.58959 1.310103 -1.228268
H  -4.26657 0.505175 -2.799148
H  -5.854371 0.301809 -1.994429
H  6.219199 -1.811858 -0.050061
H  6.248093 -0.677567 -1.373614
