program: Gaussian 09
title: 000232147
version: EM64L-G09RevD.01
frameworkgroup: C1[X(C11H8ClFN4O2)]
method: RPBEPBE
basis: SDD
operation: Freq
keyword: #p
keyword: freq=noraman
keyword: PBEPBE/SDD
title: #p freq=noraman PBEPBE/SDD
converged: YES YES NO NO
title: Mulliken charges:
elementType: Cl F O O N N N N C C C C C C C C C C C H H H H H H H H
charge: 0.028922 -0.197826 -0.186045 -0.269057 -0.428106 0.009038 0.040963 0.045001 0.203544 0.052561 0.430874 0.213134 -0.408723 -0.271944 -0.733414 -0.344040 -0.368092 -0.374508 0.328350 0.363330 0.247665 0.324155 0.256178 0.256392 0.257102 0.263004 0.261541
chargesum: 0.00000
title: Mulliken charges with hydrogens summed into heavy atoms:
elementType: Cl F O O N N N N C C C C C C C C C C C
charge: 0.028922 -0.197826 -0.186045 -0.269057 -0.064775 0.009038 0.040963 0.045001 0.203544 0.052561 0.430874 0.213134 -0.161058 0.052212 0.036258 -0.081037 -0.106551 -0.374508 0.328350
polarizability: 3.15497704e+02 -1.12979848e+01 2.17308970e+02 2.07234595e-01 1.80043546e-01 6.55275630e+01
1716.lowfreq: -1.8122 -0.0017 -0.0010 0.0012 3.8982 4.6399 17.3647 38.1598 44.4900
frequency: 17.0840 38.0768 44.4742 72.6383 77.4932 138.6732 180.9229 186.9562 210.4682 218.3865 244.4378 285.1549 289.6809 318.1564 321.4473 384.6823 388.3734 399.1526 415.6502 488.4716 495.6097 520.2548 526.4514 568.2721 573.3908 626.1890 635.7906 684.1622 703.1521 717.7489 744.3330 770.6133 783.7657 811.8619 834.1137 845.8254 901.2446 921.2331 951.6193 964.5924 985.1977 1002.0023 1017.5603 1036.9595 1060.8642 1113.9331 1140.6524 1160.3905 1201.8998 1210.0584 1244.0557 1252.1749 1297.8537 1313.2314 1335.2999 1386.0412 1397.4508 1416.8977 1425.8601 1449.7416 1450.4394 1465.0914 1498.6412 1527.5602 1578.5577 1607.8574 1617.5094 3005.0229 3083.0772 3135.5147 3138.1619 3160.6399 3174.1310 3182.0960 3207.8510
redmass: 6.5209 5.5153 4.8100 12.0391 12.3006 8.1584 5.7858 11.3612 8.9305 8.4198 1.0622 8.5958 9.7359 9.3112 5.6085 6.3723 5.9405 7.0531 3.1041 9.8843 8.2889 2.6261 8.9426 4.1313 5.5180 7.3344 10.2498 12.6419 8.4612 3.8342 6.8657 6.5165 9.3209 1.3189 6.1371 1.4912 9.2831 1.1977 1.3075 2.5894 1.3107 2.9012 7.6604 1.6229 2.6591 1.3190 9.2634 1.4570 1.9189 4.4329 7.0355 5.5764 1.3961 6.3515 4.7053 6.9526 1.2789 3.9464 2.1989 1.0587 2.5360 2.7710 2.8679 5.1941 3.4434 3.7760 4.1194 1.0373 1.0948 1.1016 1.0907 1.0797 1.0918 1.0957 1.0953
irintensity: 1.4561 0.1616 0.0339 0.0623 1.4373 0.9298 0.7660 1.4301 1.4514 0.5190 0.9983 3.4444 5.8322 0.2752 8.7774 0.0272 1.2187 5.1882 0.0031 15.5288 37.4693 24.4646 7.0593 1.2331 2.0923 1.9961 2.4010 0.1316 3.7022 0.7532 9.3232 2.4150 7.1748 5.7663 12.7084 67.3668 74.4089 78.3133 32.1313 6.8874 1.7856 9.6597 8.6008 6.2597 16.7580 32.0975 523.3432 75.4595 29.0303 68.4563 62.0968 6.2872 19.7735 121.0776 164.3666 0.8167 52.1381 9.9800 192.8278 19.7067 87.3890 306.9442 85.6643 584.7100 209.8976 25.9961 198.6519 0.1656 2.8967 17.5450 2.7341 96.2935 1.4794 2.5455 11.5001
temp: 298.150 k
press: 1.00000 atm
elementType: 17 9 8 8 7 7 7 7 6 6 6 6 6 6 6 6 6 6 6 1 1 1 1 1 1 1 1
symmnumber: 1
zpe: 475999.4 jmol-1
zpe.correction: 0.181299 hartree
zpe.thermalcorrener: 0.197544 hartree
zpe.thermalcorrenthalpy: 0.198489 hartree
zpe.thermalcorrgfe: 0.135149 hartree
zpe.sumelectzpe: -1351.905567 hartree
zpe.sumelectthermal: -1351.889321 hartree
zpe.sumelectthermalent: -1351.888377 hartree
zpe.sumelectthermalfe: -1351.951716 hartree
dipole: -0.0585 -0.5593 -0.0183
dipole: 0.5627
quadrupole: -122.2445 -126.5653 -115.6621
quadrupole: 4.5675 -0.0386 0.1442
quadrupole: -0.7539 -5.0747 5.8286 4.5675 -0.0386 0.1442
hfenergy: -1352.0868654 hartree
pointgroup: C01 [X(C11H8Cl1F1N4O2)]
dipole: -0.0194544 0.208828 0.070827 debye
polarizability: 315.2859254|12.7102042|204.7641105|-8.1135195|41.1980696|78.2842009 unknown
InChI: InChI=1S/C11H8ClFN4O2/c1-6-9(17(18)19)10(16-11(12)14-6)15-8-4-2-7(13)3-5-8/h2-5,15H,1H3
charge 0 multiplicity 1
27 atoms
Cl 1.688866 -3.653287 -1.231987
F  -5.872428 -0.517618 0.050422
O  3.382919 2.592699 0.531464
O  1.125397 2.734065 0.710863
N  -0.384599 0.708209 0.177238
N  0.686905 -1.294397 -0.475304
N  3.102214 -1.450796 -0.637136
N  2.21995 2.044784 0.440376
C  0.765593 0.025484 -0.084444
C  2.084864 0.654907 0.03747
C  -1.749164 0.309092 0.118733
C  3.245327 -0.141254 -0.253821
C  -2.692426 1.317005 0.470943
C  -2.206993 -0.983982 -0.257247
C  4.675624 0.326449 -0.179475
C  -4.072687 1.048453 0.450828
C  -3.590248 -1.255745 -0.278288
C  1.836651 -1.923906 -0.719208
C  -4.493774 -0.239583 0.074277
H  -0.183474 1.690978 0.465495
H  -2.342844 2.314649 0.760916
H  -1.484355 -1.753584 -0.52606
H  4.93316 0.691996 0.829713
H  5.320423 -0.521553 -0.452432
H  4.860411 1.178547 -0.856353
H  -4.80743 1.812473 0.718112
H  -3.963181 -2.243185 -0.564592
