program: Gaussian 09
title: 000232130
version: EM64L-G09RevD.01
frameworkgroup: C1[X(C10H12N2O3)]
method: RPBEPBE
basis: SDD
operation: Freq
keyword: #p
keyword: freq=noraman
keyword: PBEPBE/SDD
title: #p freq=noraman PBEPBE/SDD
converged: YES YES NO NO
title: Mulliken charges:
elementType: O O O N N C C C C C C C C C C H H H H H H H H H H H H
charge: -0.246093 -0.412850 -0.241180 -0.394049 -0.372051 -0.529997 -0.471645 0.252724 0.461134 -0.418399 -0.345093 0.193900 -0.196519 -0.206800 -0.264384 0.279145 0.226168 0.297757 0.256925 0.317459 0.307177 0.221616 0.233204 0.223364 0.222092 0.227417 0.378980
chargesum: 0.00000
title: Mulliken charges with hydrogens summed into heavy atoms:
elementType: O O O N N C C C C C C C C C C
charge: -0.246093 -0.033871 -0.241180 -0.076590 -0.064874 -0.024684 0.083037 0.252724 0.461134 -0.196783 -0.111889 0.193900 0.026845 0.015292 -0.036967
polarizability: 1.81709628e+02 4.50770405e+00 1.25906506e+02 -1.38358077e+01 5.18003666e+00 8.40333335e+01
1716.lowfreq: -7.8281 -3.5538 -0.0005 0.0005 0.0006 5.0395 16.5579 28.9299 36.6605
frequency: 16.0344 28.9220 36.6488 45.6725 67.4347 86.4904 131.3353 184.1143 218.5345 241.5713 280.0738 301.3236 406.0149 426.5627 437.9936 489.8921 510.9308 516.4946 538.4948 570.9812 610.4963 617.1229 637.2254 649.5955 692.4461 711.1611 756.9864 795.8051 822.3125 829.3174 879.0890 886.3058 941.7631 960.0908 980.5883 981.9868 1010.5949 1022.4873 1038.8230 1079.7653 1092.0001 1121.1223 1168.1878 1170.9497 1182.3113 1215.2146 1242.6646 1264.6196 1294.2323 1314.9378 1332.9346 1377.8254 1384.4622 1432.0747 1441.4864 1450.0195 1452.8700 1485.5943 1497.8933 1601.4291 1616.4937 1632.9231 1663.6343 2992.1362 3000.2495 3045.6974 3073.4870 3118.1242 3128.8924 3141.5285 3154.4778 3168.9274 3501.9678 3513.4248 3522.0670
redmass: 5.5609 7.9958 4.3843 7.5757 4.6992 2.3279 4.7029 5.0568 3.9346 5.1746 2.9748 4.2184 2.8920 4.2143 2.1472 3.5131 1.7865 2.7248 1.8353 3.3496 3.3672 3.2547 3.9971 1.4679 1.9787 3.9112 1.7239 1.7524 1.5973 2.4497 4.4596 1.4714 5.2454 1.3671 1.3022 5.9227 2.1309 2.1922 3.4896 1.8044 2.1040 2.0273 1.3782 1.0979 1.1099 2.1425 1.4046 1.3152 2.6683 1.4173 1.8187 1.9711 4.6436 2.1351 1.0750 1.4132 1.2605 2.4652 1.4523 5.3932 6.3933 6.5872 8.0890 1.0616 1.0624 1.0989 1.0973 1.0867 1.0863 1.0927 1.0943 1.1011 1.0767 1.0640 1.0787
irintensity: 0.2109 0.6381 0.1480 3.7155 5.0769 0.8704 8.5178 2.9569 7.1127 12.5255 3.1268 5.3013 0.6726 49.6936 62.1854 27.8661 41.2993 11.1295 98.7322 56.2298 12.5695 7.9393 33.1059 146.5806 38.7115 1.6017 87.7015 18.0152 2.7345 8.1608 2.6848 8.8260 15.3352 0.1984 0.6729 0.2064 37.6219 20.4676 135.0248 67.3269 79.7362 39.4064 1.1762 2.2498 8.3928 52.7842 53.5621 24.6914 44.2975 8.5231 71.1109 42.1230 13.9270 17.6171 9.4621 98.8699 79.2076 93.3687 25.7240 15.6806 146.0977 121.0429 189.6715 6.6985 33.9484 11.2239 9.9493 10.6973 1.0256 23.9531 35.1786 14.7317 15.6539 26.0985 34.6918
temp: 298.150 k
press: 1.00000 atm
elementType: 8 8 8 7 7 6 6 6 6 6 6 6 6 6 6 1 1 1 1 1 1 1 1 1 1 1 1
symmnumber: 1
zpe: 551695.8 jmol-1
zpe.correction: 0.210130 hartree
zpe.thermalcorrener: 0.224842 hartree
zpe.thermalcorrenthalpy: 0.225786 hartree
zpe.thermalcorrgfe: 0.164781 hartree
zpe.sumelectzpe: -722.323088 hartree
zpe.sumelectthermal: -722.308377 hartree
zpe.sumelectthermalent: -722.307432 hartree
zpe.sumelectthermalfe: -722.368437 hartree
dipole: -0.8216 -0.8879 2.5017
dipole: 2.7788
quadrupole: -76.8337 -86.6368 -90.0805
quadrupole: 1.0737 -3.4715 -3.2250
quadrupole: 7.6833 -2.1198 -5.5635 1.0737 -3.4715 -3.2250
hfenergy: -722.5332182 hartree
pointgroup: C01 [X(C10H12N2O3)]
dipole: 0.3648208 0.3986585 -0.9503901 debye
polarizability: 182.7052413|3.2367511|111.5852449|-10.0215215|20.9349426|97.3589819 unknown
InChI: InChI=1S/C10H12N2O3/c13-9(6-7-10(14)15)12-11-8-4-2-1-3-5-8/h1-5,11-12,14H,6-7H2
charge 0 multiplicity 1
27 atoms
O  0.690033 -1.562245 0.150504
O  5.752149 -0.696367 0.495449
O  4.593979 1.173861 1.236316
N  -0.052355 0.219776 -1.147254
N  -1.321512 -0.328889 -1.382737
C  2.211175 0.351393 -0.1864
C  3.404052 -0.604606 -0.011023
C  0.90481 -0.427583 -0.363738
C  -2.399032 -0.015079 -0.503946
C  -3.592818 -0.779953 -0.600354
C  -2.334171 1.07042 0.406415
C  4.592058 0.077549 0.632386
C  -4.701427 -0.461164 0.208936
C  -3.454205 1.380006 1.208764
C  -4.643837 0.622375 1.118304
H  2.120499 0.974744 0.724561
H  2.381764 1.05054 -1.026386
H  3.089454 -1.448309 0.635577
H  3.720924 -1.059361 -0.965742
H  0.172477 1.0823 -1.648072
H  -1.282829 -1.294903 -1.722271
H  -3.648208 -1.619548 -1.304491
H  -1.413371 1.655386 0.496276
H  -5.614054 -1.062693 0.129397
H  -3.391468 2.217675 1.912885
H  -5.507439 0.866999 1.745185
H  6.506453 -0.242526 0.96116
