program: Gaussian 09
title: 000232158
version: EM64L-G09RevD.01
frameworkgroup: C1[X(C14H19NO6)]
method: RPBEPBE
basis: SDD
operation: Freq
keyword: #p
keyword: freq=noraman
keyword: PBEPBE/SDD
title: #p freq=noraman PBEPBE/SDD
converged: YES YES NO NO
title: Mulliken charges:
elementType: O O O O O O N C C C C C C C C C C C C C C H H H H H H H H H H H H H H H H H H H
charge: -0.280915 -0.321751 -0.262906 -0.254302 -0.252589 -0.214300 -0.413679 0.306919 -0.538867 0.001031 0.042248 0.251102 -0.526966 -0.796172 0.156550 0.250958 0.255869 -0.484405 -0.660136 -0.496882 -0.506791 0.240254 0.248034 0.341268 0.290146 0.282687 0.237259 0.243852 0.263576 0.242810 0.252999 0.222077 0.218340 0.240312 0.227863 0.242893 0.242645 0.237669 0.231323 0.239981
chargesum: 0.00000
title: Mulliken charges with hydrogens summed into heavy atoms:
elementType: O O O O O O N C C C C C C C C C C C C C C
charge: -0.280915 -0.321751 -0.262906 -0.254302 -0.252589 -0.214300 -0.072411 0.306919 -0.050579 0.001031 0.042248 0.251102 0.045868 -0.051486 0.156550 0.250958 0.255869 0.011403 0.020592 0.216520 0.202182
polarizability: 2.24470396e+02 -1.01779926e+01 2.13052039e+02 7.73860799e+00 -1.19295025e+00 1.22234020e+02
1716.lowfreq: -5.1009 -3.7287 -0.0010 -0.0004 0.0005 3.0653 18.5953 26.5458 31.9838
frequency: 18.5092 26.5328 31.8412 37.5396 48.7897 54.6366 61.2765 76.1207 83.6071 93.4947 100.5144 106.2133 112.9385 115.6135 144.0478 166.4564 181.4015 185.3064 188.6149 220.0945 236.5331 252.2974 268.3443 287.7389 303.1360 340.8515 358.5451 403.8108 421.9084 442.7330 529.2011 564.5985 569.5650 588.7691 614.3908 636.2449 648.5177 657.7895 693.5256 710.0966 731.7394 746.1182 785.8158 791.1551 814.7901 829.6856 859.0644 927.0465 953.4442 984.3345 1006.5729 1028.8394 1039.4060 1043.1542 1056.3901 1066.8240 1084.5277 1106.1420 1112.8909 1115.5796 1124.1560 1143.4384 1147.5342 1148.2586 1193.3019 1207.2294 1245.2574 1247.9595 1271.7337 1297.6769 1338.2738 1348.0305 1357.2364 1399.5606 1404.2048 1420.2271 1422.0567 1436.9192 1442.2893 1444.2050 1451.2230 1452.6024 1457.0211 1464.7743 1467.6184 1469.4862 1471.9118 1472.7805 1481.8700 1484.3822 1525.2345 1582.1896 1639.5019 1641.4401 1672.3991 2976.8795 2995.4298 3000.0882 3000.9896 3001.6115 3002.6287 3014.1257 3050.3364 3053.0081 3064.2755 3085.6300 3096.4272 3102.0481 3102.1460 3102.8609 3106.1600 3141.7398 3145.5298 3594.2659
redmass: 5.4232 5.1469 2.5971 3.6585 4.5235 3.2785 3.4191 1.3823 1.2955 2.4630 2.2764 1.2730 3.1627 3.5445 3.8212 4.4676 1.6649 1.9834 3.4582 4.0011 2.9293 3.6971 4.6438 5.1088 4.0108 5.2478 7.7578 5.5821 5.7848 4.6475 2.7591 3.4335 3.5346 4.7937 6.6625 3.4574 1.2260 4.8854 5.9115 6.3686 4.4603 6.9966 2.2015 1.3603 3.5187 4.6027 5.6359 4.8920 6.2278 1.6063 2.1483 2.4472 4.9782 1.5107 3.8620 2.9113 1.7790 2.5448 1.2680 1.2596 2.4730 1.6423 2.7689 1.4540 1.7742 3.4627 1.1731 1.5897 1.2778 1.3619 1.7379 3.5999 1.6407 1.2096 1.2710 1.4279 1.1921 2.0665 1.0897 1.0957 1.0496 1.0505 2.1163 1.0527 1.0586 1.2447 1.0525 1.0404 1.0572 1.8368 7.4308 6.2078 8.8664 9.5779 10.1843 1.0387 1.0626 1.0374 1.0418 1.0298 1.0497 1.0598 1.0982 1.0958 1.0990 1.1006 1.1006 1.1044 1.1045 1.0964 1.1002 1.1046 1.1045 1.0810
irintensity: 0.7531 1.9124 0.5170 0.3252 3.7690 3.0969 0.4459 0.1125 0.2373 0.5181 0.4443 0.5901 0.3246 0.0831 1.8475 7.2000 1.2595 1.1308 4.2999 3.2703 2.4655 7.7536 12.7896 39.7494 4.1940 2.4726 7.7478 4.5303 2.9140 2.7844 5.1601 8.3083 5.8661 0.9486 5.9823 3.1492 80.0333 6.1284 4.9390 3.9976 2.7808 10.2765 9.0680 12.8234 22.2218 35.1905 16.3880 17.0965 12.0794 1.0247 103.9447 47.8344 329.8720 13.3906 222.4743 21.2411 0.5493 171.1970 0.5768 0.0731 114.4547 78.7329 129.1016 1.3423 28.4748 86.6168 0.9888 154.0337 24.4031 70.5010 74.1537 118.6664 18.8236 18.0577 1.6292 1.2384 23.5620 45.3790 53.7928 6.8554 13.1580 13.5029 12.3791 12.5567 16.1321 24.7612 14.4971 13.1097 17.1405 1.8217 140.4296 83.6721 178.4517 254.7884 164.6287 41.5613 17.2215 23.4660 52.6183 45.9529 2.3859 12.5570 16.4104 4.1455 5.1724 5.5969 29.3896 27.1251 29.3744 7.6005 26.7166 18.7015 18.1529 102.2197
temp: 298.150 k
press: 1.00000 atm
elementType: 8 8 8 8 8 8 7 6 6 6 6 6 6 6 6 6 6 6 6 6 6 1 1 1 1 1 1 1 1 1 1 1 1 1 1 1 1 1 1 1
symmnumber: 1
zpe: 825876.9 jmol-1
zpe.correction: 0.314560 hartree
zpe.thermalcorrener: 0.338812 hartree
zpe.thermalcorrenthalpy: 0.339757 hartree
zpe.thermalcorrgfe: 0.256679 hartree
zpe.sumelectzpe: -1049.404350 hartree
zpe.sumelectthermal: -1049.380098 hartree
zpe.sumelectthermalent: -1049.379154 hartree
zpe.sumelectthermalfe: -1049.462232 hartree
dipole: -2.1990 -3.5165 -1.1736
dipole: 4.3103
quadrupole: -97.2423 -105.5009 -129.4925
quadrupole: 3.4240 2.4769 -2.9289
quadrupole: 13.5030 5.2443 -18.7473 3.4240 2.4769 -2.9289
hfenergy: -1049.7189101 hartree
pointgroup: C01[X(C14H19N1O6)]
dipole: 0.7208309 1.4767391 -0.418864 debye
polarizability: 225.8145163|-8.4907478|211.0533728|-10.720362|4.3432493|122.8885663 unknown
InChI: InChI=1S/C14H19NO6/c1-5-10(16)21-13-8(2)15-12(14(18)20-4)9(13)6-7-11(17)19-3/h15H,5-7H2,1-4H3
charge 0 multiplicity 1
40 atoms
O  -1.159663 2.206238 0.724184
O  4.211893 -0.075926 -0.402473
O  -1.664452 -3.780206 -0.926964
O  2.778969 -1.840515 0.191945
O  -2.353944 -2.759656 1.047877
O  -2.201908 1.068964 -1.048713
N  2.276164 1.781965 -0.225448
C  0.598936 0.38219 0.446625
C  -0.186392 -0.834993 0.86078
C  0.126432 1.728235 0.361165
C  1.961945 0.444418 0.065631
C  1.165179 2.587927 -0.053236
C  -0.596057 -1.709938 -0.351669
C  1.157539 4.06822 -0.284392
C  2.953268 -0.612479 -0.023018
C  -1.615294 -2.76391 0.034541
C  -2.290189 1.784842 -0.034776
C  -3.554479 2.326157 0.605741
C  -4.781135 2.227255 -0.319364
C  5.30095 -1.066541 -0.533222
C  -2.668945 -4.842631 -0.683929
H  -1.097419 -0.529842 1.40549
H  0.41555 -1.452778 1.550735
H  3.209197 2.075506 -0.513072
H  -1.054327 -1.070816 -1.131127
H  0.285114 -2.199845 -0.79924
H  1.949951 4.581069 0.292478
H  1.300142 4.320614 -1.352478
H  0.187366 4.483344 0.032557
H  -3.363993 3.364685 0.931985
H  -3.720053 1.745977 1.535662
H  -4.650962 2.848095 -1.222761
H  -5.686947 2.569952 0.21034
H  -4.939934 1.187158 -0.649988
H  6.181745 -0.483159 -0.837862
H  5.043752 -1.822313 -1.294626
H  5.476414 -1.573664 0.430633
H  -3.68281 -4.409836 -0.638746
H  -2.566873 -5.525764 -1.538884
H  -2.456231 -5.360499 0.266614
