program: Gaussian 09
title: 000232129
version: EM64L-G09RevD.01
frameworkgroup: C1[X(C11H9Cl2NO2)]
method: RPBEPBE
basis: SDD
operation: Freq
keyword: #p
keyword: freq=noraman
keyword: PBEPBE/SDD
title: #p freq=noraman PBEPBE/SDD
converged: YES YES NO NO
title: Mulliken charges:
elementType: Cl Cl O O N C C C C C C C C C C C H H H H H H H H H
charge: -0.057779 -0.059592 -0.298882 -0.265244 -0.458550 0.498099 -0.430190 -0.337120 -0.181972 -0.193037 -0.121798 0.273229 -0.379634 0.093734 0.103555 -0.679370 0.231720 0.304102 0.337086 0.256783 0.256027 0.270228 0.255700 0.290568 0.292338
chargesum: 0.00000
title: Mulliken charges with hydrogens summed into heavy atoms:
elementType: Cl Cl O O N C C C C C C C C C C C
charge: -0.057779 -0.059592 -0.298882 -0.265244 -0.121464 0.498099 -0.198470 -0.033019 0.074811 0.062989 -0.121798 0.273229 0.146295 0.093734 0.103555 -0.096464
polarizability: 2.49829295e+02 1.01478276e+01 1.05301392e+02 8.01150523e+00 -6.76007695e+00 1.25043889e+02
1716.lowfreq: -6.1391 -2.9478 -0.0037 -0.0034 -0.0029 3.2885 9.5518 15.2753 30.7178
frequency: 9.4963 15.2159 30.6151 52.6005 72.2202 78.4700 113.5019 131.2337 165.1311 227.0915 239.8364 268.2557 297.0873 324.8998 331.9137 365.3656 407.6808 411.9589 433.5770 505.7615 537.4745 617.3215 625.6359 641.1302 653.6079 677.8796 697.1545 704.4514 772.0431 814.7993 823.0914 842.6223 886.2982 891.4940 939.0793 970.7677 975.5392 993.9754 1003.7045 1074.9501 1117.9961 1143.2616 1155.5454 1188.0364 1195.0253 1244.2225 1247.5169 1260.0889 1299.0317 1343.3394 1372.5093 1403.7960 1432.5196 1437.1525 1479.6896 1511.6259 1595.7651 1610.0711 1675.1585 2276.0111 3014.6251 3053.8728 3087.1221 3126.1010 3128.5627 3165.4266 3173.2725 3191.9378 3540.5640
redmass: 13.3715 5.5655 4.3678 7.7168 6.9982 11.2397 5.5305 5.3813 6.0396 7.7187 7.2182 4.4885 4.7850 4.0679 5.4993 5.6660 7.8988 3.0183 8.7694 2.7367 8.1668 6.8204 7.4535 1.4146 5.0938 7.0770 4.6635 3.7606 4.8186 1.3827 5.6427 1.4111 6.4951 1.5313 1.3540 4.1403 1.3186 3.7124 2.9460 2.6706 1.3405 1.0873 3.5223 1.1134 3.7762 1.1870 1.1188 2.0995 1.3396 1.2929 5.1924 3.8172 1.0970 1.1108 2.2818 2.3306 5.5230 6.2238 8.6519 11.7314 1.0592 1.0562 1.1024 1.1091 1.0902 1.0908 1.0954 1.0957 1.0762
irintensity: 1.0312 2.1135 2.9607 0.6807 5.9955 1.0091 0.3687 2.8076 3.4052 4.3669 1.7532 6.2595 10.6531 30.7684 3.1442 4.5880 30.7272 0.0879 9.3873 38.9209 11.2107 4.8673 74.2156 34.6732 35.0357 6.4328 39.5751 8.8068 9.3528 43.7784 4.2665 62.8503 4.6419 1.4224 1.2124 285.3361 2.0717 37.4789 186.7847 63.5578 39.1742 0.0499 397.3069 6.3974 50.4183 54.2845 6.2416 6.5885 14.5439 36.8231 96.9698 34.7221 38.7755 7.4989 49.0527 687.4728 28.6486 42.5867 255.7799 5.3096 24.4354 9.0310 2.0415 1.4836 12.8152 2.2666 2.4824 4.5782 36.6372
temp: 298.150 k
press: 1.00000 atm
elementType: 17 17 8 8 7 6 6 6 6 6 6 6 6 6 6 6 1 1 1 1 1 1 1 1 1
symmnumber: 1
zpe: 461129.2 jmol-1
zpe.correction: 0.175635 hartree
zpe.thermalcorrener: 0.191658 hartree
zpe.thermalcorrenthalpy: 0.192602 hartree
zpe.thermalcorrgfe: 0.126741 hartree
zpe.sumelectzpe: -1548.690180 hartree
zpe.sumelectthermal: -1548.674158 hartree
zpe.sumelectthermalent: -1548.673213 hartree
zpe.sumelectthermalfe: -1548.739075 hartree
dipole: 0.7806 0.8342 0.9297
dipole: 1.4729
quadrupole: -128.1764 -105.2027 -97.7584
quadrupole: 4.8139 -12.5647 2.5070
quadrupole: -17.7972 5.1764 12.6208 4.8139 -12.5647 2.5070
hfenergy: -1548.8658153 hartree
pointgroup: C01 [X(C11H9Cl2N1O2)]
dipole: -0.2744838 -0.0170721 -0.5100865 debye
dipolederiv: -0.8238085 0.0662145 -0.2891385 0.055665 -0.1143628 -0.0059093 -0.3319245 0.0021545 -0.2127036 -0.5871259 -0.2495614 0.0921735 -0.4049928 -0.4176157 0.0793567 -0.1273389 -0.098033 -0.1708507 -2.1496267 0.032441 -0.2361812 0.0905254 -0.3984728 -0.0787045 -0.8110656 0.0421949 -0.6015772 -0.8253928 0.0561355 -0.0702684 0.334927 -0.8321492 -0.1516403 -0.0541644 -0.2912402 -0.4673295 -2.0185688 0.3940668 -0.295778 0.8251717 -0.5351932 0.1462003 -0.2796054 0.0448614 -0.3608249 1.3422851 -0.1623041 0.3652422 0.0357746 0.0116238 -0.0519185 0.618394 -0.1350075 0.2442329 -0.2670039 -0.0208358 -0.0141558 0.1070905 -0.0299751 0.1575597 0.0357288 0.1008467 -0.10437 -0.23177 0.0129947 -0.0018643 -0.1470052 -0.0498794 0.0142089 -0.1303729 0.080178 -0.149367 -0.1756158 -0.0068787 -0.0408856 -0.080095 0.0212342 0.0345196 -0.0937383 0.0691047 -0.0873572 -0.2004921 -0.0057878 -0.0514635 0.0574971 0.0205243 0.0937221 -0.0134829 0.0708904 -0.0562342 1.0307567 -0.084609 0.4616752 -0.0770104 -0.0069495 0.0170068 0.4944858 0.0123956 0.1468204 2.7640768 -0.3846848 0.4603741 -0.8686359 1.2279587 0.1924749 0.7252259 0.3986481 0.6636243 1.3859091 0.0045616 -0.1436694 -0.5164409 0.2985181 -0.0798049 -0.2232247 -0.0616999 0.3810613 -0.2377346 0.0718881 -0.0209403 0.0592152 -0.1371911 0.0857361 0.0379056 -0.0060551 -0.1046514 -0.3460747 -0.1295355 0.022987 -0.1213065 -0.1710811 -0.042809 0.2292296 0.0760561 -0.2433495 0.9028555 0.428012 -0.1066374 0.5959838 0.5851718 -0.0520305 0.0121909 0.0512759 0.2905506 0.048875 -0.0482565 -0.0939419 -0.038598 0.03244 -0.1051494 -0.0841278 -0.1125623 0.0541913 0.1568261 0.050876 0.0068067 0.0395155 0.0897013 -0.0448947 0.0134267 -0.0347213 0.1517144 0.2242457 0.0610544 -0.0307595 0.0064817 0.1970736 -0.0553806 -0.0436216 -0.05232 0.2759976 0.0444683 0.0827037 -0.0007678 0.0827123 0.0340193 -0.0472572 -0.0039501 -0.0455018 0.1339517 0.0820016 -0.0198838 -0.048912 -0.0266111 0.0481703 -0.0843852 -0.0551472 -0.0831035 0.0808689 0.025078 -0.0821883 0.0494243 0.0738666 0.0026477 0.003727 0.1251997 -0.0403156 0.1084515 -0.0754673 -0.0017628 -0.0046566 0.0358592 0.1328931 -0.020286 -0.0080089 0.0415195 -0.055123 -0.0521262 -0.0212384 0.0503479 -0.0340354 -0.0324752 -0.0615394 0.0196325 -0.058207 0.0787065 -0.0165705 -0.0434213 -0.0590107 -0.0855543 0.0233687 0.0571973 -0.0516461 0.0286417 0.0035669 unknown
polarizability: 247.6036709|-1.6505311|121.4469411|21.7588485|10.1720288|111.123964 unknown
InChI: InChI=1S/C11H9Cl2NO2/c12-7-1-2-8-16-11(15)14-10-5-3-9(13)4-6-10/h3-6,14H,7-8H2
charge 0 multiplicity 1
25 atoms
Cl 5.974796 -0.502634 1.62273
Cl -6.735215 -1.547661 0.590326
O  -1.597727 0.317339 -1.591991
O  -0.510088 1.748581 -0.055182
N  0.469244 -0.247105 -0.887545
C  1.751304 -0.258513 -0.27276
C  2.609054 -1.350901 -0.570178
C  2.191598 0.762936 0.610036
C  3.893669 -1.430076 0.003403
C  3.478571 0.682942 1.183385
C  4.313669 -0.407665 0.876279
C  -0.52012 0.708157 -0.755654
C  -2.81419 1.17204 -1.48518
C  -3.763686 0.658991 -0.494124
C  -4.582293 0.235428 0.327125
C  -5.524933 -0.24965 1.315128
H  2.277124 -2.144037 -1.251079
H  1.533598 1.6027 0.841597
H  0.234033 -1.027436 -1.505188
H  4.552846 -2.271834 -0.226311
H  3.822691 1.467279 1.863829
H  -2.501476 2.201301 -1.228295
H  -3.250412 1.152222 -2.497466
H  -6.178882 0.547282 1.700048
H  -5.026977 -0.772684 2.145463
