program: Gaussian 09
title: 000232128
version: EM64L-G09RevD.01
frameworkgroup: C1[X(C11H9Cl2NO2)]
method: RPBEPBE
basis: SDD
operation: Freq
keyword: #p
keyword: freq=noraman
keyword: PBEPBE/SDD
title: #p freq=noraman PBEPBE/SDD
converged: YES YES NO NO
title: Mulliken charges:
elementType: Cl Cl O O N C C C C C C C C C C C H H H H H H H H H
charge: -0.063291 -0.059540 -0.291653 -0.266153 -0.447338 0.589462 -0.352705 -0.329497 -0.215593 -0.219070 -0.241353 0.274645 -0.379212 0.095093 0.104170 -0.679786 0.305282 0.342440 0.256423 0.233956 0.237192 0.268495 0.255920 0.289946 0.292164
chargesum: 0.00000
title: Mulliken charges with hydrogens summed into heavy atoms:
elementType: Cl Cl O O N C C C C C C C C C C C
charge: -0.063291 -0.059540 -0.291653 -0.266153 -0.104897 0.589462 -0.352705 -0.024214 0.040831 0.014886 -0.004161 0.274645 0.145203 0.095093 0.104170 -0.097676
polarizability: 2.20273171e+02 -9.89104268e+00 1.46089540e+02 -1.47951925e+01 1.14807723e+01 1.04517545e+02
1716.lowfreq: -4.3429 -3.3777 0.0003 0.0017 0.0024 2.0084 10.1963 13.2577 29.9798
frequency: 10.1171 13.1864 29.9444 59.1188 79.1481 84.7270 114.7741 141.1595 166.8797 209.2894 249.2019 274.6492 279.7761 299.3426 340.8919 379.8416 415.0114 422.1933 439.4262 519.7004 537.9375 608.8693 626.3501 662.0920 676.7741 678.8972 709.0755 732.8922 761.2602 772.4227 828.3351 870.7070 887.0823 891.8573 948.4294 971.5899 991.7117 1000.0074 1014.2145 1043.2804 1127.9014 1143.4397 1164.0135 1174.0046 1194.9855 1244.2938 1244.4521 1248.6609 1308.3902 1344.4590 1375.7301 1431.4143 1431.6006 1437.2996 1456.5053 1519.7679 1580.0154 1615.9780 1671.4628 2276.5028 3016.3108 3053.4632 3088.9389 3125.6543 3143.5731 3160.1541 3177.5054 3188.3802 3495.6551
redmass: 7.8560 13.1719 4.0791 9.4554 8.0946 6.3154 5.8209 4.9224 5.5629 6.7898 6.6176 4.2746 4.6318 4.9980 4.6562 7.5639 7.6432 8.3932 3.3859 8.8058 3.6065 6.1237 7.4556 6.0476 2.7811 7.1787 3.3195 1.8539 1.2638 4.7872 5.6223 1.3466 6.6257 1.5316 1.3567 3.9502 1.3136 2.9209 6.0612 2.0127 1.6323 1.0871 3.1521 1.0792 3.7453 1.2431 1.5121 1.1288 1.7215 1.2820 6.7176 1.0967 2.5474 1.1145 2.2571 2.5121 5.1676 6.5617 8.5019 11.7323 1.0591 1.0562 1.1025 1.1091 1.0866 1.0918 1.0974 1.0964 1.0760
irintensity: 0.1026 0.8959 3.2363 2.6777 4.2022 1.7597 0.9188 3.4116 2.0267 2.9043 6.9336 3.9899 8.4202 11.2369 26.4654 6.5917 12.8699 9.8622 11.2131 12.9382 5.1128 1.0388 72.4576 20.0377 4.4918 10.8072 23.3795 37.0594 136.2117 12.8110 22.6233 4.0691 9.5446 1.1576 5.2070 204.5096 1.9030 119.0553 154.8185 6.6772 32.3445 0.0465 408.8350 5.0957 46.5165 38.8519 25.9310 6.2036 26.5051 32.5632 89.2857 34.8306 99.3586 8.3524 17.3002 583.9315 20.0505 139.7334 233.9679 5.0508 22.4166 9.2175 1.5479 1.5791 3.9640 11.0138 6.2043 10.2691 69.2098
temp: 298.150 k
press: 1.00000 atm
elementType: 17 17 8 8 7 6 6 6 6 6 6 6 6 6 6 6 1 1 1 1 1 1 1 1 1
symmnumber: 1
zpe: 461654.9 jmol-1
zpe.correction: 0.175835 hartree
zpe.thermalcorrener: 0.191773 hartree
zpe.thermalcorrenthalpy: 0.192717 hartree
zpe.thermalcorrgfe: 0.127204 hartree
zpe.sumelectzpe: -1548.691082 hartree
zpe.sumelectthermal: -1548.675144 hartree
zpe.sumelectthermalent: -1548.674200 hartree
zpe.sumelectthermalfe: -1548.739712 hartree
dipole: 1.7931 -1.5208 -0.3166
dipole: 2.3724
quadrupole: -103.3635 -108.5121 -100.1492
quadrupole: 7.4290 -5.7225 2.5800
quadrupole: 0.6447 -4.5038 3.8591 7.4290 -5.7225 2.5800
hfenergy: -1548.8669166 hartree
pointgroup: C01 [X(C11H9Cl2N1O2)]
dipole: -0.7314765 -0.5273609 0.2409118 debye
dipolederiv: -0.1779508 -0.1095301 0.1095494 -0.0547782 -0.5194932 0.2881555 0.084197 0.2990169 -0.2604719 -0.5970527 -0.2376673 -0.1283406 -0.4043914 -0.4019934 -0.1101148 0.0814065 0.0672571 -0.1713627 -2.0714516 0.0058056 0.194985 -0.0553691 -0.3978318 0.1063677 0.802196 -0.0178072 -0.574089 -0.8198873 0.0760231 0.0552082 0.3017123 -0.8741843 0.1256139 0.0859411 0.2441373 -0.4269041 -2.0229794 0.375812 0.3117166 0.7738754 -0.5588092 -0.110552 0.3606616 -0.0285875 -0.3729878 1.2475395 -0.1878351 -0.2815629 0.1567708 -0.1426619 0.0994411 -0.5823816 0.223138 0.193492 -0.1388149 0.1661806 -0.1085388 0.1926216 0.6803363 -0.5296223 -0.090218 -0.5001482 0.2195556 -0.2413877 0.0783364 -0.0313586 -0.2130676 -0.0545063 0.0209882 0.1507985 -0.0922382 -0.1532041 0.0029367 -0.0388815 -0.0159372 -0.0997656 -0.1017288 0.0598901 0.0152213 0.027056 -0.1089002 0.0359259 -0.0502056 -0.0476374 0.0372093 0.0811894 -0.1292583 -0.1020222 -0.097829 -0.0523657 -0.0691331 -0.0177144 -0.0550076 0.0040966 -0.099953 -0.0448017 -0.0515968 -0.0347782 -0.1307329 2.7610886 -0.3722719 -0.4459903 -0.7071683 1.2765947 -0.1678335 -0.8095191 -0.3303034 0.6064896 1.3864357 -0.0038492 0.1571954 -0.4830977 0.2863937 0.0622343 0.1434243 0.050197 0.3956354 -0.2371183 0.0657768 0.0274669 0.0600043 -0.127117 -0.0856215 -0.0325386 0.0003839 -0.1143185 -0.3429549 -0.1221224 -0.0384992 -0.0926272 -0.1648045 0.0495692 -0.2399761 -0.0663541 -0.2519676 0.917134 0.4088713 0.165338 0.5758883 0.5608941 0.0884478 0.0548758 -0.01734 0.2978346 0.1610753 0.0399483 0.0022891 0.0476718 0.0795853 0.0402489 -0.0159548 0.0371993 0.1566996 0.2749131 0.0133558 0.0361585 -0.0843788 0.2644635 0.0310804 0.061898 0.0190679 0.2815316 0.0548512 0.0720777 0.0080794 0.0897211 0.0239491 0.037392 0.0009138 0.0434679 0.1418436 0.0772981 -0.0216767 0.0459437 -0.0442641 -0.0189868 0.1117466 0.0601851 0.1053642 0.0773565 -0.0652336 0.0041085 0.0992857 0.0076442 0.0940103 0.0381103 0.1012004 0.0386594 0.1044106 0.0104822 -0.0734223 -0.0586916 0.084444 -0.0071662 -0.0234647 -0.1092107 0.0252328 0.1087123 -0.0716803 -0.0055147 -0.0002678 0.0239357 0.1308719 0.0475648 0.0126513 -0.0137705 -0.0502992 -0.052261 -0.018568 -0.0547011 -0.0304531 -0.0435408 0.0507996 -0.0238888 0.0470751 0.0869659 -0.0217748 -0.0470368 0.0533172 -0.0862342 0.0344888 -0.0563817 0.0417358 -0.0280968 -0.0029234 unknown
polarizability: 221.9976355|4.7049599|137.1033064|-11.7326445|-19.8614311|111.779314 unknown
InChI: InChI=1S/C11H9Cl2NO2/c12-7-3-4-8-16-11(15)14-10-6-2-1-5-9(10)13/h1-2,5-6,14H,7-8H2
charge 0 multiplicity 1
25 atoms
Cl -2.499122 2.594519 -1.355821
Cl 6.480186 1.363059 0.777645
O  1.309418 -0.226308 -1.616532
O  0.301479 -1.854281 -0.233348
N  -0.766425 0.179906 -0.835737
C  -2.029821 0.067363 -0.209553
C  -2.967162 1.12594 -0.357137
C  -2.419908 -1.056397 0.569656
C  -4.240041 1.093119 0.232211
C  -3.697244 -1.097412 1.164882
C  -4.611794 -0.032174 1.003368
C  0.260861 -0.744797 -0.817883
C  2.551851 -1.050362 -1.626737
C  3.487214 -0.65865 -0.569187
C  4.29699 -0.336669 0.305072
C  5.229493 0.029292 1.352306
H  -1.710808 -1.877415 0.694343
H  -0.587899 1.037628 -1.368494
H  -4.926765 1.932274 0.089719
H  -3.976788 -1.972569 1.76069
H  -5.602222 -0.068071 1.467324
H  2.271256 -2.114814 -1.522355
H  2.986016 -0.869909 -2.623857
H  5.858958 -0.815413 1.670411
H  4.725177 0.481043 2.219916
