program: Gaussian 09
title: 000232198
version: EM64L-G09RevD.01
frameworkgroup: C1[X(C18H23NO6)]
method: RPBEPBE
basis: SDD
operation: Freq
keyword: #p
keyword: freq=noraman
keyword: PBEPBE/SDD
title: #p freq=noraman PBEPBE/SDD
converged: YES YES NO NO
title: Mulliken charges:
elementType: O O O O O O N C C C C C C C C C C C C C C C C C C H H H H H H H H H H H H H H H H H H H H H H H
charge: -0.238050 -0.300314 -0.231934 -0.206142 -0.208785 -0.264785 -0.452595 0.159588 -0.430992 -0.533066 0.227112 0.155443 0.122869 0.256373 0.280693 -0.253525 -0.258682 -0.788449 -0.341780 -0.346810 -0.666200 -0.654020 -0.249434 -0.230312 -0.224656 0.270177 0.284239 0.241379 0.249921 0.347076 0.229380 0.238738 0.224245 0.241056 0.258563 0.214069 0.253824 0.244556 0.278876 0.216700 0.247735 0.234739 0.220779 0.253950 0.232826 0.228734 0.233775 0.233118
chargesum: 0.00000
title: Mulliken charges with hydrogens summed into heavy atoms:
elementType: O O O O O O N C C C C C C C C C C C C C C C C C C
charge: -0.238050 -0.300314 -0.231934 -0.206142 -0.208785 -0.264785 -0.105519 0.159588 0.123424 -0.041767 0.227112 0.155443 0.122869 0.256373 0.280693 0.214593 0.206618 -0.061994 -0.097224 -0.067933 0.032974 0.053536 -0.020700 0.003463 0.008461
polarizability: 2.56445597e+02 1.23542892e+01 2.24390264e+02 2.94551076e+00 1.86910968e+01 1.78015997e+02
1716.lowfreq: -7.6264 -5.4153 -0.0002 0.0001 0.0006 0.4856 12.5383 18.3315 23.1733
frequency: 12.2480 18.0638 23.0255 30.8740 41.3468 47.3010 51.7482 52.5738 69.1828 72.7274 92.2289 95.9643 100.1700 104.4587 118.2211 123.2677 154.3590 160.8620 193.5761 200.6512 208.8906 233.8988 254.0615 274.8062 290.2446 307.4003 309.3656 344.8586 355.2807 391.8521 401.2043 416.2680 423.1506 441.8583 478.9916 516.2625 535.7545 568.5371 578.7304 601.1989 613.7504 621.3277 648.5023 658.8300 697.7800 718.2592 736.9060 752.0426 756.1753 785.7685 813.2865 814.8946 819.1472 825.4487 844.7657 859.6770 901.4654 941.7611 958.0856 969.6401 983.1842 989.9519 991.3679 1006.0365 1007.6320 1012.1441 1018.0862 1028.5870 1041.8238 1055.6680 1082.8816 1091.5418 1094.7009 1097.6838 1122.4040 1152.3951 1156.1961 1159.1880 1165.5837 1173.1695 1187.8511 1212.0764 1215.8361 1266.9433 1275.1058 1276.6036 1293.7902 1297.2711 1317.3255 1351.7260 1352.3263 1356.3980 1383.9288 1387.3804 1392.2070 1395.2470 1433.3631 1436.5543 1447.0095 1456.5810 1457.7239 1459.3116 1460.0279 1462.6600 1463.2680 1472.2643 1479.5085 1482.3749 1484.3353 1572.0648 1600.0608 1610.5933 1613.8460 1625.6907 1643.2112 2960.3646 2994.5797 2996.6636 2996.9470 3012.3499 3033.7648 3036.3478 3055.7557 3090.2117 3092.7714 3094.7108 3097.7672 3097.7793 3106.5941 3123.3520 3123.5401 3124.8400 3127.7639 3137.8393 3149.3839 3158.3468 3169.0268 3538.5161
redmass: 4.2707 5.5675 4.1566 4.1140 3.5388 3.3077 3.7946 4.4981 1.2452 5.4652 2.6707 3.9981 4.2341 4.3827 4.2594 3.7347 4.7685 3.4120 1.5212 1.4198 3.7054 2.9026 2.9045 3.4356 4.8415 2.9611 3.1315 5.4847 4.9907 5.6970 2.8185 3.2611 3.7403 3.6085 4.9287 4.3566 4.3251 2.2782 3.5391 3.9617 6.4158 1.7283 4.4600 3.3477 1.8291 3.7697 3.9007 3.6320 1.7010 2.0224 1.6559 1.5249 2.3738 2.8115 3.5122 1.2498 3.9634 1.4727 4.4338 2.8768 2.3717 6.1008 1.3756 2.6102 2.0927 1.4480 3.2247 2.0825 1.6766 3.0220 1.7659 2.5602 2.2335 2.1796 2.3387 2.4475 1.9205 1.8808 5.1195 1.0714 1.1275 2.4032 2.0570 1.7830 1.1239 1.1900 1.6042 1.3758 1.3440 1.2785 1.3664 1.5067 1.2331 9.1959 1.2329 1.2262 1.2939 1.7614 1.1409 1.1331 1.1133 1.1109 1.1993 1.0524 1.0535 1.3696 2.2034 1.0535 1.0535 6.7411 6.8105 6.9983 6.7102 9.4122 10.2545 1.0601 1.0361 1.0359 1.0363 1.0971 1.0593 1.0599 1.0608 1.0973 1.0975 1.0991 1.1030 1.1033 1.0996 1.1054 1.1043 1.1069 1.0850 1.0880 1.0923 1.0960 1.1012 1.0779
irintensity: 2.3222 1.7048 0.0548 1.5962 2.6211 0.7414 0.2439 1.0859 1.0058 6.2704 7.4452 0.5417 3.6453 2.2211 0.9049 0.7665 0.5225 0.5868 2.3811 4.3885 1.0837 4.2869 7.4985 3.5523 4.0152 13.6062 3.3388 10.4315 6.2580 5.1397 0.1146 1.4733 3.6975 0.8316 4.9274 35.4943 19.8556 8.3935 40.0312 49.5770 1.2526 10.7185 18.0162 31.6668 45.4782 3.1437 1.7608 10.6082 80.5634 0.9881 0.8692 5.6690 4.9832 4.0543 12.8230 1.0424 1.8095 0.1774 29.4949 17.5004 23.9261 4.4732 0.5600 31.6063 44.9242 16.9330 73.5573 7.0379 10.6168 125.3357 21.4092 21.5122 78.2117 1.5817 201.1791 113.3774 9.4035 21.3483 165.4660 4.9318 28.0363 77.5557 44.4884 78.3952 6.4619 14.0084 66.3789 47.9146 8.7985 0.6482 21.7668 20.0332 63.5757 2.2865 23.3389 28.5892 6.5341 22.3978 98.5940 45.3848 77.7814 10.9014 109.0854 20.0966 7.1584 82.7793 0.8091 14.1274 18.6971 78.5707 37.0610 151.3646 31.0624 160.5283 99.9899 31.0886 18.7768 9.3771 15.6398 11.5913 28.0253 23.1489 1.0857 36.4703 27.9817 13.9216 0.5134 2.2920 11.6513 13.6600 13.2199 25.1306 0.3071 6.6325 19.9648 21.5174 22.7332 71.8595
temp: 298.150 k
press: 1.00000 atm
elementType: 8 8 8 8 8 8 7 6 6 6 6 6 6 6 6 6 6 6 6 6 6 6 6 6 6 1 1 1 1 1 1 1 1 1 1 1 1 1 1 1 1 1 1 1 1 1 1 1
symmnumber: 1
zpe: 1003696.1 jmol-1
zpe.correction: 0.382288 hartree
zpe.thermalcorrener: 0.409590 hartree
zpe.thermalcorrenthalpy: 0.410535 hartree
zpe.thermalcorrgfe: 0.319452 hartree
zpe.sumelectzpe: -1203.947230 hartree
zpe.sumelectthermal: -1203.919927 hartree
zpe.sumelectthermalent: -1203.918983 hartree
zpe.sumelectthermalfe: -1204.010066 hartree
dipole: 1.3773 6.4384 0.6334
dipole: 6.6144
quadrupole: -128.5901 -135.6862 -147.3855
quadrupole: 4.4260 7.9967 8.8377
quadrupole: 8.6305 1.5344 -10.1649 4.4260 7.9967 8.8377
hfenergy: -1204.3295173 hartree
pointgroup: C01 [X(C18H23N1O6)]
dipole: 0.7671475 -2.4578329 0.3776397 debye
polarizability: 258.094192|-10.1593124|228.7422367|-4.6562492|5.08123|172.0154286 unknown
InChI: InChI=1S/C18H23NO6/c1-4-24-16(22)18(19-13(3)20,17(23)25-5-2)12-11-15(21)14-9-7-6-8-10-14/h6-10,19H,4-5,11-12H2,1-3H3
charge 0 multiplicity 1
48 atoms
O  -2.688774 1.748482 0.506047
O  -1.153641 -2.474122 0.567248
O  -3.775461 -0.082303 -0.442681
O  -1.288807 -0.822285 2.207012
O  2.102144 2.517416 0.118661
O  -1.758305 1.003822 -2.710447
N  -1.217241 -0.869701 -1.452994
C  -1.306111 -0.147292 -0.173129
C  -0.162187 0.894084 0.007576
C  1.230244 0.246722 -0.059238
C  -2.732948 0.505916 -0.080281
C  -1.255176 -1.153317 1.004367
C  2.357208 1.281705 0.021417
C  -1.49301 -0.236282 -2.653821
C  3.783055 0.798169 -0.017644
C  -4.002181 2.450852 0.683234
C  -1.193354 -3.539004 1.625982
C  -1.467494 -1.127241 -3.88946
C  4.124007 -0.577316 -0.126254
C  4.823674 1.763753 0.058565
C  -4.675742 2.008224 1.984141
C  -2.64145 -3.898486 1.962362
C  5.47735 -0.977001 -0.156288
C  6.174097 1.365085 0.028025
C  6.504897 -0.007911 -0.078998
H  -0.303374 1.405037 0.97246
H  -0.270851 1.656058 -0.780238
H  1.371848 -0.482375 0.766083
H  1.343093 -0.328219 -1.000928
H  -1.154978 -1.888764 -1.401282
H  -3.7174 3.514338 0.6992
H  -4.629409 2.234961 -0.198907
H  -0.646599 -4.377853 1.166984
H  -0.649981 -3.163027 2.510185
H  -2.493956 -1.215218 -4.287322
H  -1.075128 -2.139671 -3.691869
H  -0.852614 -0.647045 -4.668852
H  3.339101 -1.33845 -0.18793
H  4.540162 2.818352 0.141327
H  -5.592618 2.604804 2.146956
H  -4.960329 0.943928 1.937105
H  -4.00429 2.161405 2.846112
H  -2.654862 -4.733085 2.687533
H  -3.16417 -3.04057 2.416562
H  -3.192349 -4.213699 1.060111
H  5.732723 -2.03912 -0.239895
H  6.968807 2.116714 0.087239
H  7.555181 -0.319775 -0.102239
