program: Gaussian 09
title: 000232150
version: EM64L-G09RevD.01
frameworkgroup: C1[X(C17H17NO3)]
method: RPBEPBE
basis: SDD
operation: Freq
keyword: #p
keyword: freq=noraman
keyword: PBEPBE/SDD
title: #p freq=noraman PBEPBE/SDD
converged: YES YES NO NO
title: Mulliken charges:
elementType: O O O N C C C C C C C C C C C C C C C C C H H H H H H H H H H H H H H H H H
charge: -0.318099 -0.294227 -0.242093 -0.407133 -0.410998 -0.335834 -0.303478 0.167640 0.247954 0.226434 0.188536 -0.353090 -0.327835 -0.342511 -0.336000 -0.223833 -0.234618 -0.241834 -0.215227 -0.223908 -0.225360 0.212407 0.250042 0.212614 0.259681 0.249474 0.222841 0.349485 0.276220 0.224065 0.272385 0.272388 0.230481 0.229223 0.229748 0.237534 0.239395 0.237533
chargesum: 0.00000
title: Mulliken charges with hydrogens summed into heavy atoms:
elementType: O O O N C C C C C C C C C C C C C C C C C
charge: -0.318099 -0.294227 -0.242093 -0.057648 0.051451 0.136462 0.168836 0.167640 0.247954 0.226434 0.188536 -0.076871 -0.103770 -0.070126 -0.063612 0.006648 -0.005394 -0.012086 0.022306 0.015487 0.012174
polarizability: 2.07784946e+02 -2.83767329e+00 2.59366592e+02 -2.63195960e+01 -2.37133962e+00 1.17762070e+02
1716.lowfreq: -5.1712 -0.8892 -0.0008 -0.0003 0.0002 4.3441 11.1225 22.0175 28.0064
frequency: 10.7955 21.9848 28.0015 43.0226 54.7752 59.2539 74.3792 102.0796 136.7174 153.9665 175.5191 207.3215 250.3486 267.4744 303.4639 324.6945 361.1915 387.4273 402.3668 405.0221 426.6278 434.6442 466.2039 490.2090 495.5401 613.2934 614.0745 630.6586 653.9436 659.1326 679.3091 687.4182 701.9166 705.0180 753.5406 792.3742 795.2639 801.3338 813.9930 855.1914 868.5167 878.6140 914.8449 935.2959 938.8286 956.8533 985.2975 989.7399 990.3168 998.8174 1005.5711 1011.3725 1012.3149 1023.6504 1037.1454 1049.2143 1082.3273 1085.8962 1092.6533 1113.7236 1157.8580 1171.5956 1175.2152 1181.7005 1189.9893 1209.5564 1230.9858 1240.0561 1272.3241 1281.4832 1314.8351 1317.2967 1349.9551 1360.9809 1369.6097 1384.5490 1389.4266 1431.9495 1437.9420 1444.8580 1451.1049 1468.6624 1477.0892 1490.5134 1499.7302 1567.8665 1584.8240 1603.7005 1610.0369 1611.1447 1629.3601 2950.8009 2996.0570 3028.6733 3057.6445 3062.9743 3104.4973 3123.4009 3132.3560 3132.7086 3144.0324 3144.7612 3156.1161 3156.3390 3167.6701 3167.9070 3176.5680 3528.4792
redmass: 4.5291 4.9138 5.4700 5.4200 5.0188 5.4594 5.8923 3.5198 5.5715 3.8089 4.6807 4.7699 5.5165 3.0304 4.9646 5.7441 3.4977 3.2358 2.8203 2.8522 3.7404 4.2176 3.6924 4.3138 2.5235 5.7756 6.0845 1.2383 5.4745 6.3692 5.0082 4.1931 1.5746 1.5816 5.1665 2.3928 2.2158 2.8760 3.8267 1.2505 1.2439 2.0134 2.4300 1.6478 2.2105 1.4105 1.4170 5.2965 6.1394 1.3946 1.3414 1.4510 3.2298 2.4090 2.1851 3.0427 1.6537 1.6218 2.3605 2.1463 2.7365 1.0608 1.0573 1.1426 1.1440 1.2339 1.4347 2.7812 1.1569 1.9030 1.3207 1.3371 1.3833 1.4984 1.3105 9.0934 10.0225 2.2234 2.2325 1.0877 1.1071 2.0069 2.2570 1.0800 2.1656 6.8008 6.4797 6.6840 6.0719 6.0680 10.0263 1.0704 1.0623 1.0592 1.0922 1.0972 1.1088 1.0847 1.0876 1.0862 1.0929 1.0890 1.0959 1.0935 1.0971 1.1000 1.0994 1.0783
irintensity: 1.1924 0.4355 0.1406 1.9186 4.2134 3.6869 0.3249 1.0608 1.2738 0.9947 1.3835 2.4296 9.7144 2.0880 8.7017 7.2790 3.3798 4.5218 0.1909 0.1040 3.3264 2.9776 1.9873 0.3974 3.1409 3.4500 1.4250 75.7567 8.7184 5.3150 16.2620 5.8553 176.1393 24.1826 19.2134 25.6436 15.3178 4.1691 4.0546 4.1097 1.2671 11.1936 18.8080 10.0446 4.3997 5.1312 0.8124 0.5753 2.6853 0.4201 2.0254 17.6727 123.9250 3.5171 44.8533 129.8225 15.6552 6.8420 4.8150 19.8660 14.0915 1.2979 0.0690 25.6069 9.3417 12.6586 66.8613 197.9703 39.8005 78.2509 1.7280 2.5270 2.1318 4.1919 8.6424 2.3099 2.6407 1.1487 15.9249 26.9521 17.0390 153.4706 3.4581 25.6809 216.0459 110.3901 23.8017 58.8309 12.2237 5.6315 174.2183 53.2957 21.2368 28.4992 23.0808 26.0199 10.3081 1.1801 5.2800 0.1707 33.9682 6.9067 15.2052 11.7888 20.1575 16.4010 8.5888 110.7612
temp: 298.150 k
press: 1.00000 atm
elementType: 8 8 8 7 6 6 6 6 6 6 6 6 6 6 6 6 6 6 6 6 6 1 1 1 1 1 1 1 1 1 1 1 1 1 1 1 1 1
symmnumber: 1
zpe: 795203.7 jmol-1
zpe.correction: 0.302877 hartree
zpe.thermalcorrener: 0.321871 hartree
zpe.thermalcorrenthalpy: 0.322815 hartree
zpe.thermalcorrgfe: 0.251440 hartree
zpe.sumelectzpe: -936.952621 hartree
zpe.sumelectthermal: -936.933627 hartree
zpe.sumelectthermalent: -936.932683 hartree
zpe.sumelectthermalfe: -937.004058 hartree
dipole: 3.1556 -2.6167 1.7951
dipole: 4.4752
quadrupole: -137.9813 -101.6211 -124.3196
quadrupole: 3.3842 -3.3796 4.4421
quadrupole: -16.6740 19.6862 -3.0123 3.3842 -3.3796 4.4421
hfenergy: -937.2554983 hartree
pointgroup: C01 [X(C17H17N1O3)]
dipole: -0.7257865 1.3564213 -0.856356 debye
polarizability: 255.2962755|-12.7148358|214.757194|13.8986957|16.2317272|114.860139 unknown
InChI: InChI=1S/C17H17NO3/c19-16(14-8-3-1-4-9-14)18-12-7-13-21-17(20)15-10-5-2-6-11-15/h1-6,8-11,18H,7,12-13H2
charge 0 multiplicity 1
38 atoms
O  2.027286 1.033234 -0.85165
O  1.220407 -3.95425 0.642306
O  2.524893 2.825066 0.563535
N  1.516314 -1.735412 0.026553
C  3.640303 -0.459764 0.362537
C  2.983955 -1.826009 0.083278
C  3.456452 0.58434 -0.749774
C  0.718642 -2.826506 0.323062
C  -0.775092 -2.620411 0.238813
C  0.27746 2.613024 -0.365422
C  1.69659 2.210164 -0.149668
C  -1.587186 -3.780797 0.161797
C  -1.394146 -1.343156 0.253841
C  -0.2277 3.691972 0.407538
C  -0.560131 1.966989 -1.312434
C  -2.990495 -3.668338 0.079261
C  -2.799754 -1.230552 0.174239
C  -3.601704 -2.391554 0.081225
C  -1.561625 4.115166 0.24021
C  -1.894384 2.395598 -1.477074
C  -2.397385 3.4673 -0.701394
H  4.730767 -0.622749 0.474709
H  3.279784 -0.043778 1.321345
H  3.380012 -2.243978 -0.867506
H  3.239163 -2.554413 0.872692
H  4.07942 1.475198 -0.561319
H  3.673144 0.164076 -1.746607
H  1.117427 -0.866063 -0.334779
H  -1.089499 -4.755971 0.177212
H  -0.800261 -0.42818 0.362072
H  0.438707 4.180563 1.125939
H  -0.158936 1.150646 -1.919744
H  -3.607656 -4.571424 0.016419
H  -3.264833 -0.238455 0.196286
H  -4.692301 -2.302768 0.02112
H  -1.950156 4.946239 0.838196
H  -2.538251 1.898995 -2.210787
H  -3.433432 3.798852 -0.832926
