program: Gaussian 09
title: 000232131
version: EM64L-G09RevD.01
frameworkgroup: C1[X(C10H12N2O4)]
method: RPBEPBE
basis: SDD
operation: Freq
keyword: #p
keyword: freq=noraman
keyword: PBEPBE/SDD
title: #p freq=noraman PBEPBE/SDD
converged: YES YES NO NO
title: Mulliken charges:
elementType: O O O O N N C C C C C C C C C C H H H H H H H H H H H H
charge: -0.303955 -0.436829 -0.315634 -0.249019 -0.399481 -0.393520 0.328476 0.088960 -0.347796 -0.298439 -0.201297 -0.257111 0.150114 -0.254717 0.311023 -0.662135 0.249881 0.272769 0.381777 0.227570 0.233227 0.338504 0.237737 0.222104 0.217077 0.223613 0.251655 0.385444
chargesum: 0.00000
title: Mulliken charges with hydrogens summed into heavy atoms:
elementType: O O O O N N C C C C C C C C C C
charge: -0.303955 -0.051385 -0.315634 -0.249019 -0.017704 -0.055015 0.328476 0.088960 -0.097915 -0.025670 0.026273 -0.023884 0.150114 0.205125 0.311023 0.030211
polarizability: 1.87021337e+02 1.75932022e+00 1.52295085e+02 -1.59791270e+01 4.43434320e-01 8.40501008e+01
1716.lowfreq: -6.0652 -0.0009 -0.0008 -0.0005 3.6781 6.0396 26.6727 29.8436 40.8399
frequency: 26.3392 29.8372 40.7166 75.2392 88.2063 96.9105 131.4051 183.7661 196.0007 224.6163 264.8281 271.8678 303.6105 329.9706 387.2782 406.0435 422.7111 494.9232 515.7604 531.2922 555.6409 572.4779 595.4344 634.1644 657.0939 679.1577 689.6444 732.5984 753.7900 757.4414 781.1878 801.6193 830.8503 853.7046 872.5365 941.3319 970.7417 991.5642 1007.7915 1026.8872 1040.2561 1095.4192 1105.4113 1144.1798 1158.1095 1161.3704 1177.8119 1218.7732 1264.2782 1281.6242 1320.2067 1340.5236 1357.5095 1390.3750 1397.4520 1442.4743 1447.5684 1455.0599 1461.5970 1465.7335 1484.0757 1505.6498 1586.4969 1599.6529 1636.7224 1682.5633 2991.4668 3028.4859 3086.7461 3091.2263 3117.4988 3134.2496 3157.0633 3169.9765 3181.3627 3350.7259 3523.7255 3534.0263
redmass: 3.8461 4.8860 3.9583 6.1721 5.4192 7.3145 4.1349 2.3952 4.9232 2.0063 5.4905 2.6722 4.4703 5.5799 9.1054 3.9291 3.1258 5.2010 1.7108 1.6629 5.6913 1.2028 4.6946 5.2897 5.1422 3.6114 4.4016 1.5665 3.7590 2.6173 1.7869 1.1815 4.5306 3.9762 1.4466 4.3132 1.3643 1.3249 5.1971 3.6514 2.1484 2.1638 2.2704 3.0452 1.7301 1.5890 1.1517 2.1261 1.7294 1.1094 2.0926 2.5506 1.2319 1.2347 8.1611 2.3693 2.3541 1.2394 1.1609 1.2674 1.0578 2.7745 6.6255 3.1908 5.6502 9.0413 1.0359 1.0598 1.0974 1.1031 1.1060 1.0869 1.0898 1.0942 1.0989 1.0826 1.0779 1.0641
irintensity: 0.0485 0.9176 1.9125 5.6299 0.4030 0.1423 0.1509 0.2473 4.7407 5.4166 5.5057 2.3386 5.0930 17.1424 6.1824 13.7676 10.8095 8.0483 74.6673 60.3358 1.7046 120.2329 43.6342 2.8129 36.4066 16.5286 49.8775 103.7873 34.3359 47.7400 9.6076 2.8485 12.9818 1.3351 1.3072 21.3652 2.4343 0.2207 303.0076 54.0128 18.6055 70.0000 281.6889 253.7191 23.3179 185.7946 5.3765 42.6705 71.1617 3.7241 66.4761 53.0577 2.5710 26.8386 1.0061 13.3280 56.3123 37.4938 51.5982 84.3085 21.5471 184.4423 120.5471 60.0361 276.4212 213.4362 17.7139 36.5730 39.2724 1.2588 35.3497 6.8349 10.7969 9.7918 11.5500 135.8549 34.5372 60.9069
temp: 298.150 k
press: 1.00000 atm
elementType: 8 8 8 8 7 7 6 6 6 6 6 6 6 6 6 6 1 1 1 1 1 1 1 1 1 1 1 1
symmnumber: 1
zpe: 564125.6 jmol-1
zpe.correction: 0.214864 hartree
zpe.thermalcorrener: 0.230393 hartree
zpe.thermalcorrenthalpy: 0.231338 hartree
zpe.thermalcorrgfe: 0.169950 hartree
zpe.sumelectzpe: -797.481829 hartree
zpe.sumelectthermal: -797.466300 hartree
zpe.sumelectthermalent: -797.465355 hartree
zpe.sumelectthermalfe: -797.526743 hartree
dipole: 1.1459 1.4284 -1.7527
dipole: 2.5348
quadrupole: -72.9882 -87.5373 -96.1914
quadrupole: 3.0014 -3.9066 0.7009
quadrupole: 12.5841 -1.9650 -10.6191 3.0014 -3.9066 0.7009
hfenergy: -797.6966931 hartree
pointgroup: C01 [X(C10H12N2O4)]
dipole: 0.4279743 0.6056009 -0.6668201 debye
polarizability: 186.4857977|3.4382171|152.2442257|-17.1574924|3.2745882|84.6365001 unknown
InChI: InChI=1S/C10H12N2O4/c1-2-16-10(15)12-11-8-6-4-3-5-7(8)9(13)14/h3-6,11-13H,2H2,1H3
charge 0 multiplicity 1
28 atoms
O  3.599615 -0.416591 -0.782813
O  -3.963455 -1.584618 0.510705
O  -1.952777 -2.487933 -0.186611
O  2.228973 -0.807723 1.106415
N  0.039198 -0.815682 -0.761094
N  1.369648 -0.586598 -1.086297
C  -0.81236 0.225109 -0.391505
C  -2.164558 -0.062176 0.022709
C  -0.384047 1.584204 -0.434468
C  -3.032296 1.011316 0.373626
C  -1.264324 2.619263 -0.08342
C  -2.597899 2.343612 0.322573
C  -2.633724 -1.450353 0.092058
C  4.80424 -0.385978 0.097183
C  2.376269 -0.621194 -0.121413
C  5.018521 1.01027 0.687596
H  0.642747 1.807058 -0.737292
H  -4.050417 0.76457 0.687106
H  -0.301419 -1.782466 -0.634736
H  -0.910499 3.655952 -0.121816
H  -3.274374 3.159169 0.594914
H  1.632144 -0.473343 -2.068134
H  4.67609 -1.141564 0.892258
H  5.623339 -0.681818 -0.577741
H  5.962699 1.030841 1.263272
H  5.085038 1.770162 -0.110406
H  4.194092 1.27526 1.370763
H  -4.184965 -2.553744 0.534864
