program: Gaussian 09
title: 000232119
version: EM64L-G09RevD.01
frameworkgroup: C1[X(C8H15NO2)]
method: RPBEPBE
basis: SDD
operation: Freq
keyword: #p
keyword: freq=noraman
keyword: PBEPBE/SDD
title: #p freq=noraman PBEPBE/SDD
converged: YES YES NO NO
title: Mulliken charges:
elementType: O O N C C C C C C C C H H H H H H H H H H H H H H H
charge: -0.327694 -0.300027 -0.382993 0.048024 -0.444211 -0.429226 -0.395578 -0.398570 -0.386717 0.306612 -0.609035 0.232540 0.202525 0.212049 0.235952 0.196319 0.203412 0.196857 0.199651 0.203169 0.201224 0.189380 0.323436 0.225486 0.271131 0.226285
chargesum: 0.00000
title: Mulliken charges with hydrogens summed into heavy atoms:
elementType: O O N C C C C C C C C
charge: -0.327694 -0.300027 -0.059557 0.280564 -0.029638 0.003045 0.004691 0.004249 0.003887 0.306612 0.113867
polarizability: 1.28898398e+02 9.80777127e-01 8.74762407e+01 3.63366396e+00 3.80848496e+00 7.97637418e+01
1716.lowfreq: -13.1070 0.0004 0.0005 0.0007 6.9724 8.9823 49.7260 54.8006 80.5710
frequency: 49.6402 54.7533 80.5247 108.3493 155.1079 177.8227 214.3803 255.1668 296.2266 324.5484 352.2266 428.1714 443.6178 477.0033 567.0159 582.0979 666.2890 698.9343 785.5222 791.6442 837.5080 875.3426 881.7130 896.4901 921.1714 945.8860 1004.9641 1044.1551 1051.9837 1080.5919 1104.0691 1110.2568 1126.1117 1143.9266 1152.4104 1196.7524 1203.5657 1241.0871 1252.9355 1257.9731 1300.8569 1309.0365 1331.6849 1335.8241 1338.2096 1351.4499 1361.0592 1428.2803 1461.1435 1461.7061 1463.6817 1464.8351 1472.2058 1480.7139 1485.0751 1516.0219 1666.5752 2969.8471 2970.9667 2973.0379 2975.2701 2983.8560 2986.3310 3008.7150 3032.2397 3034.5930 3043.4713 3050.7197 3054.0587 3063.8800 3109.9301 3578.3015
redmass: 4.0411 3.9295 3.4223 1.1270 3.0543 3.1588 1.8257 4.4401 3.6255 1.9987 4.7408 2.9443 2.5733 1.8737 1.1151 2.8811 5.5667 12.1226 1.5443 2.1025 2.3030 3.1598 1.7616 1.6204 1.7375 3.8986 2.9638 1.8364 1.0944 1.3301 3.9670 2.8783 1.2794 1.7219 2.2912 1.5590 2.0873 1.3139 1.2763 1.3034 1.2050 1.3213 1.3604 1.4997 1.4617 1.5530 1.4460 1.1658 1.2971 1.1116 1.0920 1.0954 1.0826 1.0977 1.0445 1.4169 8.7298 1.0631 1.0628 1.0633 1.0357 1.0619 1.0645 1.0825 1.0957 1.0984 1.1011 1.1026 1.1020 1.1022 1.0977 1.0772
irintensity: 3.1494 5.6444 1.8190 0.1261 3.8157 2.5876 0.0552 7.2296 2.3752 1.1650 18.1426 0.7036 1.6612 0.5951 135.4027 0.7573 7.4162 22.0848 1.0175 1.1671 7.5253 9.9420 2.4577 17.6504 0.4405 66.7820 87.3374 0.5489 0.2556 16.6216 224.4402 35.6089 0.0059 14.1579 0.3081 32.9108 245.7809 0.6399 2.6041 4.1519 1.7692 1.0695 0.4047 3.4290 0.5344 0.9129 16.5781 30.4017 119.3326 27.0264 9.6207 14.3333 20.4063 3.1696 14.6329 155.3241 258.4478 36.8405 36.9164 35.3499 82.4982 9.3314 21.8277 22.4146 59.6600 66.3458 41.9864 39.2017 37.2144 65.8983 3.8987 33.1751
temp: 298.150 k
press: 1.00000 atm
elementType: 8 8 7 6 6 6 6 6 6 6 6 1 1 1 1 1 1 1 1 1 1 1 1 1 1 1
symmnumber: 1
zpe: 591562.4 jmol-1
zpe.correction: 0.225314 hartree
zpe.thermalcorrener: 0.237036 hartree
zpe.thermalcorrenthalpy: 0.237980 hartree
zpe.thermalcorrgfe: 0.187033 hartree
zpe.sumelectzpe: -518.185167 hartree
zpe.sumelectthermal: -518.173445 hartree
zpe.sumelectthermalent: -518.172501 hartree
zpe.sumelectthermalfe: -518.223448 hartree
dipole: -0.1530 -1.4640 -1.7417
dipole: 2.2804
quadrupole: -54.3343 -68.4218 -68.2557
quadrupole: 3.9957 5.3507 -1.5303
quadrupole: 9.3363 -4.7512 -4.5851 3.9957 5.3507 -1.5303
hfenergy: -518.4104811 hartree
pointgroup: C01 [X(C8H15N1O2)]
dipole: -0.0317067 -0.4672429 -0.765266 debye
dipolederiv: -1.9826807 0.0585817 0.0724307 0.3141353 -0.4485351 -0.0877777 0.2333212 -0.0967307 -0.4014482 -0.7903484 0.0040235 -0.0080938 0.0059709 -0.5843502 -0.325677 -0.0069833 -0.3136144 -0.7889164 -1.3506751 -0.1596977 -0.2569297 -0.1771564 -0.4822047 0.0198253 -0.3410962 0.015291 -0.524075 1.0728329 0.0462711 -0.0035933 0.1685902 0.3290611 -0.0445692 0.1934592 -0.0835733 0.2438891 -0.1020868 0.0016045 -0.0188074 0.0000571 0.0303071 -0.0105325 -0.0435803 0.0154838 0.1421616 -0.1358256 -0.0076218 -0.0198855 -0.0645516 -0.0589673 0.0236514 -0.0562121 0.0372488 0.1169222 0.0954076 -0.0188913 -0.0103872 0.0338073 0.0535142 0.0222279 0.0456852 -0.0030865 0.1535122 0.0884534 0.0243638 -0.0081139 -0.0273084 0.0798673 -0.0059892 0.0499848 0.0289479 0.1498355 0.0533483 0.0039056 0.0127508 -0.0015498 0.0350701 0.0128547 -0.0359974 0.0052883 0.1485676 2.4167987 0.0667051 0.210353 -0.1441435 0.6676971 0.549774 0.0718965 0.5327282 1.0455865 0.6058454 -0.0055345 0.0218758 -0.1740479 0.1890141 -0.1410676 -0.1799386 -0.1278777 0.102513 0.0087588 -0.0021752 0.0180632 -0.0463299 0.0258243 -0.0123407 -0.0448563 0.0146887 -0.1060725 0.047247 0.0124094 -0.0017544 0.0192256 0.0747729 0.0093936 0.0039557 -0.0585571 -0.1602196 0.0304873 -0.0856642 0.0251809 -0.0662102 -0.1440263 0.0674505 0.0369257 0.0868012 0.045992 -0.0327557 0.1177275 0.0081025 0.117036 -0.0410623 -0.0068529 0.0193542 -0.0327611 0.0693847 0.0648173 -0.0286651 0.0124018 -0.0219799 0.0522397 -0.0516706 -0.0046303 0.0078842 -0.1609296 -0.1040721 0.1285735 0.0171944 0.1332641 -0.1081274 -0.0192875 0.0397214 -0.0465275 0.0715781 0.0515433 -0.0324137 0.03127 -0.0420553 0.0549476 -0.0348219 -0.0239654 0.0181198 -0.1931466 0.0263862 0.0255759 0.0189249 0.0265623 0.0739971 -0.0040759 -0.0122454 -0.0707056 -0.1809061 -0.0162411 -0.0708363 0.0193269 -0.0856609 -0.172692 0.0701749 0.0283634 0.1031975 0.0494676 -0.2133753 -0.0584676 -0.0695687 -0.0639216 0.0249021 -0.0130231 -0.1046022 -0.0207193 0.0498574 0.0833402 0.0130405 0.0013579 0.0225571 0.0185932 -0.0207927 0.076269 -0.0058431 -0.1934651 0.1484623 0.0350101 0.0073746 0.0621416 0.2851252 -0.1002323 0.0424734 -0.1005434 0.234069 -0.0882712 0.0472325 -0.0630903 0.1135588 0.0475851 0.111772 -0.110217 0.1201563 -0.0517249 0.1567354 -0.0316167 -0.0399198 0.0387792 0.0686957 -0.0724188 0.0531653 -0.0813149 0.031193 -0.1341324 -0.0834405 0.0235368 -0.1407702 -0.0712488 0.0640053 0.0697497 0.0560191 0.1063746 unknown
polarizability: 128.6799976|1.5759183|86.2217626|4.5195207|4.9265824|81.2366205 unknown
InChI: InChI=1S/C8H15NO2/c1-9-8(10)11-7-5-3-2-4-6-7/h7,9H,2-6H2,1H3
charge 0 multiplicity 1
26 atoms
O  -0.751412 -0.566661 -0.526799
O  -1.90366 0.774544 1.048159
N  -3.011702 -0.403624 -0.66075
C  0.553278 -0.160494 0.0832
C  1.549183 -1.284758 -0.234259
C  1.004863 1.19459 -0.490757
C  2.959747 -0.919237 0.295808
C  2.412469 1.561258 0.043826
C  3.438031 0.443237 -0.262205
C  -1.903006 0.010411 0.046266
C  -4.365464 0.024967 -0.305087
H  0.398263 -0.065891 1.17598
H  1.587462 -1.427711 -1.33244
H  1.195115 -2.23371 0.209622
H  0.270665 1.974734 -0.220244
H  1.032276 1.118996 -1.596341
H  3.675213 -1.719899 0.027912
H  2.93516 -0.870517 1.404133
H  2.358345 1.718992 1.140816
H  2.741056 2.520509 -0.399318
H  4.426103 0.702963 0.164322
H  3.571778 0.361216 -1.360705
H  -2.853119 -1.026028 -1.453086
H  -4.844415 0.578926 -1.134185
H  -4.287318 0.694171 0.566601
H  -5.00521 -0.835584 -0.03347
